{"text_format":"3","workbook":"xlsx","n_sheets":2,"sheets":["Nutzungsbedingungen","Druckverlustberechnung"],"not_rendered":{"charts":2,"images":3,"defined_names":2},"read":"whole","date_system":"1900"}

{"sheet":"Nutzungsbedingungen","index":0,"n_rows":11,"n_cols":22,"rows_kept":11,"merged":[[3,1,3,9],[4,1,4,9],[5,1,5,9],[6,1,6,9],[7,1,7,9],[8,1,8,9],[9,1,9,9]]}
[{"$nulls":21},{"$f":"HLOOKUP(Druckverlustberechnung!$AB$1,Druckverlustberechnung!$AA$2:$AV$999,17,0)","v":"Nutzungsbedingungen"}]
[]
[]
[null,{"$f":"HLOOKUP(Druckverlustberechnung!$AB$1,Druckverlustberechnung!$AA$2:$AV$999,32,0)","v":"REHAU SOFTWARE INDUSTRIEROHRSYSTEM RAUPEX"}]
[null,{"$f":"HLOOKUP(Druckverlustberechnung!$AB$1,Druckverlustberechnung!$AA$2:$AV$999,33,0)","v":"Haftungsausschluss"}]
[null,{"$f":"HLOOKUP(Druckverlustberechnung!$AB$1,Druckverlustberechnung!$AA$2:$AV$999,34,0)","v":"Copyright © 2013"}]
[null,{"$f":"HLOOKUP(Druckverlustberechnung!$AB$1,Druckverlustberechnung!$AA$2:$AV$999,35,0)","v":"Alle Daten innerhalb dieser Webseite/Software sind urheberrechtlich geschützt und dürfen nicht ohne Zustimmung der Rechteinhaber verwendet werden. Die durch das Urheberrecht begründeten Rechte, insbesondere die der Übersetzung, des Nachdruckes, der Entnahme von Abbildungen, der Funksendungen, der Wiedergabe auf fotomechanischem oder ähnlichem Wege und der Speicherung in Datenverarbeitungsanlagen, bleiben vorbehalten."}]
[null,{"$f":"HLOOKUP(Druckverlustberechnung!$AB$1,Druckverlustberechnung!$AA$2:$AV$999,36,0)","v":"Kontakt: info@rehau.com "}]
[null,{"$f":"HLOOKUP(Druckverlustberechnung!$AB$1,Druckverlustberechnung!$AA$2:$AV$999,37,0)","v":"Datenschutz: Alle innerhalb dieser Webseite vom Anwender eingegebenen und verarbeiteten Daten werden vertraulich gem. § 5 BDSG behandelt und nicht an Dritte weitergegeben. Die Daten werden nur zur Bearbeitung der Anfragen benutzt. "}]
[null,{"$f":"HLOOKUP(Druckverlustberechnung!$AB$1,Druckverlustberechnung!$AA$2:$AV$999,38,0)","v":"Die Webseite/Software wird von den Herausgebern kostenlos zur Verfügung gestellt. Die Herausgeber übernehmen keinerlei Gewähr für die Aktualität, Korrektheit, zu Grunde gelegte Berechnungsformeln, Berechnungsergebnisse, Vollständigkeit oder Qualität der bereitgestellten Informationen. Haftungsansprüche gegen die Herausgeber und Autoren, die sich auf Schäden materieller oder ideeler Art beziehen, welche durch die Nutzung der dargebotenen Informationen bzw. durch Nutzung fehlerhafter oder unvollständiger Informationen verursacht wurden, sind grundsätzlich ausgeschlossen, sofern seitens der Herausgeber und Autoren kein nachweislich vorsätzliches oder grob fahrlässiges Verschulden vorliegt. Die Herausgeber behalten es sich ausdrücklich vor, Teile der Seiten oder den gesamten Inhalt ohne gesonderte Ankündigung zu verändern, zu ergänzen oder die Veröffentlichung zeitweise oder endgültig einzustellen. Aus der Veröffentlichung kann nicht entnommen werden, dass die verwendeten Bezeichnungen frei von Rechten Dritter sind. Sofern auf Verweisziele („Links“) direkt oder indirekt verwiesen wird, die außerhalb des Verantwortungsbereichs des Herausgebers/Autoren liegen, haften diese allenfalls dann, wenn sie von den Inhalten Kenntnis hatten, und es ihnen technisch möglich und zumutbar wäre, die Nutzung im Falle rechtswidriger Inhalte zu verhindern. Für darüber hinausgehende Inhalte und insbesondere für Schäden, die aus der Nutzung oder Nichtnutzung solcherart dargebotener Informationen entstehen, haftet allein der Anbieter dieser Seiten, nicht derjenige, der über Links auf die jeweilige Veröffentlichung lediglich verweist. Dieser Haftungsausschluss ist als Teil des Internetangebots dieser Seite / dieses Softwareangebots zu betrachten. Sofern Teile oder einzelne Formulierungen dieses Textes der geltenden Rechtslage nicht, nicht mehr oder nicht vollständig entsprechen sollten, bleiben die übrigen Teile des Dokuments in ihrem Inhalt und ihrer Gültigkeit davon unberührt."}]
[null,null,{"$f":"HLOOKUP(Druckverlustberechnung!$AB$1,Druckverlustberechnung!$AA$2:$AV$999,18,0)","v":"Nutzungsbedingungen akzeptieren"},{"$nulls":6},{"$f":"Druckverlustberechnung!U25","v":"Version 1.3_03/17"}]

{"sheet":"Druckverlustberechnung","index":1,"n_rows":42,"n_cols":36,"rows_kept":42,"merged":[[3,2,3,9],[5,2,6,4],[5,6,6,8],[8,11,10,13],[12,11,14,12],[12,13,14,13],[18,11,18,13],[25,11,27,13],[26,20,26,24],[27,21,27,24],[28,21,28,24],[29,21,29,24],[30,21,30,24],[31,21,31,24],[32,21,32,24],[33,11,33,13],[33,21,33,24],[34,21,34,24],[35,11,35,13]]}
[{"$nulls":21},1,{"$f":"AB2","v":"Deutsch"},1,null,null,"Sprache",{"$f":"VLOOKUP(X1,V1:W10,2,FALSE)","v":"Deutsch"}]
[null,null,{"$f":"HLOOKUP($AB$1,$AA$2:$BW$999,2,0)","v":"RAUPEX DRUCKLUFTAUSLEGUNG"},{"$nulls":10},{"$f":"U25","v":"Version 1.3_03/17"},{"$nulls":7},2,{"$f":"AC2","v":"English"},null,null,1,"Original","Deutsch","English","Italiano","Français","Español","Türkçe","Русский","Polski","汉语"]
[{"$nulls":21},3,{"$f":"AD2","v":"Italiano"},null,null,2,"RAUPEX DRUCKLUFTAUSLEGUNG","RAUPEX DRUCKLUFTAUSLEGUNG","RAUPEX COMPRESSED AIR PRESSURE LOSS CALCULATION","RAUPEX CALCOLO DELLA PERDITA DI PRESSIONE","RAUPEX RESEAUX D'AIR COMPRIME","RAUPEX CALCULADORA PARA PÉRDIDAD DE PRESION DE AIRE COMPRIMIDO","RAUPEX BASINÇLI HAVA BOYUTLANDIRMASI","РАСЧЕТ ПОТЕРЬ ДАВЛЕНИЯ В СИСТЕМАХ СЖАТОГО ВОЗДУХА RAUPEX","RAUPEX WYMIAROWANIE RUR SPRĘŻONEGO POWIETRZA","RAUPEX压缩空气设计"]
[{"$nulls":21},4,{"$f":"AE2","v":"Français"},null,null,3,"Innendurchmesser berechnen","Innendurchmesser berechnen","Calculate inner diameter","Calcolo del diametro interno","Calcul du diamètre intérieur du tube","Calcular el diámetro interno","İç çapın hesaplanması","рассчитать внутренний диаметр","Obliczanie średnicy wewnętrznej","内径计算"]
[{"$nulls":21},5,{"$f":"AF2","v":"Español"},null,null,4,"Druckverlust berechnen","Druckverlust berechnen","Calculate pressure loss","Calcolo della caduta di pressione","Calcul de la perte de charges","Calcular la pérdida de presión","Basınç kaybının hesaplanması","рассчитать потери давления","Obliczanie straty ciśnienia","压力损失计算"]
[null,null,{"$f":"HLOOKUP($AB$1,$AA$2:$BW$999,3,0)","v":"Innendurchmesser berechnen"},{"$nulls":3},{"$f":"HLOOKUP($AB$1,$AA$2:$BW$999,4,0)","v":"Druckverlust berechnen"},{"$nulls":14},6,{"$f":"AG2","v":"Türkçe"},null,null,5,"Betriebsdruck","Betriebsdruck","Operating pressure","Pressione di esercizio","Pression de service","Presión de operación","İşletim basıncı","рабочее давление","Ciśnienie robocze","工作压力"]
[{"$nulls":11},{"$f":"HLOOKUP($AB$1,$AA$2:$BW$999,10,0)","v":"Ermittlung des Druckabfalles"},{"$nulls":9},7,{"$f":"AH2","v":"Русский"},null,null,6,"Volumenstrom","Volumenstrom","Flow rate by volume","Portata","Débit","Velocida de flujo por volúmen","Hacim debisi","объемный расход","Przepływ","体流量"]
[{"$nulls":21},8,{"$f":"AI2","v":"Polski"},null,null,7,"Rohrlänge","Rohrlänge","Pipe length","Lunghezza del tubo","Longueur du tronçon","Longitud de tubería","Boru uzunluğu","длина трубопровода","Długość rury","管长"]
[{"$nulls":11},{"$f":"HLOOKUP($AB$1,$AA$2:$BW$999,11,0)","v":"Für die gesamte Rohrleitung sollte\nder Druckabfall bei Vollast 0,1 bar\nnicht überschreiten."},{"$nulls":9},9,{"$f":"AJ2","v":"汉语"},null,null,8,"Druckverlust","Druckverlust","Pressure loss","Perdita di pressione","Perte de charge","Pérdida de presión","Basınç kaybı","потеря давления","Strata ciśnienia","压力损失"]
[{"$nulls":21},10,{"$nulls":3},9,"Innendurchmesser","Innendurchmesser","Inner diameter","Diametro intero del tubo","Diamètre intérieur tube","Diámetro interior","İç çap","внутренний диаметр","Średnica wew.","内径"]
[{"$nulls":25},10,"Ermittlung des Druckabfalles","Ermittlung des Druckabfalles","Calculating the pressure loss","Determinazione della perdita di pressione","Détermination de la perte de charge","Calculando la pérdida de presión","Basınç düşümünün hesaplanması","расчет перепада давления","Wyznaczanie spadku ciśnienia","求得压力降"]
[{"$nulls":25},11,"Für die gesamte Rohrleitung sollte\nder Druckabfall bei Vollast 0,1 bar\nnicht überschreiten.","Für die gesamte Rohrleitung sollte\nder Druckabfall bei Vollast 0,1 bar\nnicht überschreiten.","The pressure loss for the whole\npiping should not be higher than\n0,1 bar at full load.","La caduta di pressione nell'interna conduttura non dovrebbe superare 0,1 bar a piano carico. Si divide la rete completa di condutture in tre settori. I questi settori di conduttura non si dovrebbe superare le seguenti cadute di pressione:","Ne pas dépasser une perte\nde charge de plus de 0,1 bar\npour l'ensemble du réseau.","La pérdida de presión de todo\nel sistema no deberá ser superior\na 0.1 bar a carga completa.","Tüm boru hattı için tam yük altındaki basınç düşümü 0,1 bar'ı aşmamalıdır. ","Для всей магистрали перепад давления в 0,1 бара при полной нагрузке не должен быть превышен","Dla jednakowego odcinka rury spadek ciśnienia przy obciążeniu 0,1 bar nie może być przekroczony.","在全负荷情况下，整个管路的压力降不能超过0.1bar。"]
[{"$nulls":11},{"$f":"HLOOKUP($AB$1,$AA$2:$BW$999,12,0)","v":"Hauptleitung\nRing-/Verteilleitung\nStichleitung"},null,"0,04 bar\n0,03 bar\n0,03 bar",{"$nulls":11},12,"Hauptleitung\nRing-/Verteilleitung\nStichleitung","Hauptleitung\nRing-/Verteilleitung\nStichleitung","main pipe\nring / distribution pipe\ndrop pipe","Condutta principale\nCondutta ad anello o di distribuzione\nTronco d'adattamento di linea","Réseau principal\nRéseau secondaire en collecteur\nRéseau secondaire en piquage","tubería principal\ntubería anillo / distribución\nlínea derivada de tubería","Ana hat\nRing / Dağıtım hattı\nİkincil bağlantı hattı","главная магистраль                                                                                              кольцевая или распределительная магистраль                       подводка","Rurociąg główny\nRurociągi rozdzielcze\nPrzewód doprowadzający","总管                                             环/分配管                                         滴管    "]
[{"$nulls":25},13,"Berechnung mit Näherungsformel:","Berechnung mit Näherungsformel:","Approximation formula:","Calcolo con formula approssimativa:","Calcul à partir de la formule suivante :","Cálculo con fórmula aproximada:","Yaklaşık hesaplama formülü:","расчет по приближенной формуле:","Obliczenia metodą kolejnych przybliżeń","用近似公式计算："]
[{"$nulls":25},14,"Beachte:","Beachte:","Note:","Nota:","Note :","Observación:","Dikkat:","следует соблюдать","Uwaga:","注意："]
[{"$nulls":25},15,"Fittings nach TI 876.600 durch\nErsatzlänge mit einbeziehen.","Fittings nach TI 876.600 durch\nErsatzlänge mit einbeziehen.","Fittings should be added to the pipe length\naccording to technical manual 876600","Considerare i raccordi  secondo TI 876.600 applicando una lunghezza equivalente per pezzi stampati.","La perte de charge des raccords peut \nêtre calculée à partir de l'équivalence \nRaccord : tubes se trouvant dans la TI 876800","Los accesorios deben ser sumados a la longitud de tubería\nsegún el manual técnico 876600","TI 876.600 uyarınca fittingler boru uzunluğuna dahil edilmelidir. ","Фитинги согласно ТИ 876.600 учитываются эквивалентной длиной","Złączki w informacji technicznej 876.600 uwzględnić przez długość zastępczą.","接头需要根据技术信息876600按照等效长度被计算在内"]
[{"$nulls":25},16,"www.rehau.de/raupex","www.rehau.de/raupex","www.rehau.com","www.rehau.com","www.rehau.com","www.rehau.com","www.rehau.com.tr","www.rehau.de/raupex","www.rehau.com/pl-pl","www.rehau.com"]
[{"$nulls":25},17,"Nutzungsbedingungen","Nutzungsbedingungen","Terms & Conditions of use","Condizioni de utilizzo","Conditions d'utilisation","Términos y condiciones de uso","Kullanım koşulları","условия применения","Warunki użytkowania","使用条件"]
[{"$nulls":11},{"$f":"HLOOKUP($AB$1,$AA$2:$BW$999,13,0)","v":"Berechnung mit Näherungsformel:"},{"$nulls":13},18,"Nutzungsbedingungen akzeptieren","Nutzungsbedingungen akzeptieren","Accept terms and conditions","Prendere atto ed accettare tutte e singole condizioni di utilizzo","Accepté conditions d'utilisation","Acepto términos y condiciones","Kullanım koşullarını kabul et","С условиями применения согласен","Akceptacja warunków użytkowania","接受使用条件"]
[{"$nulls":25},19]
[{"$nulls":24},{"$f":"HLOOKUP($AB$1,$AA$2:$AV$999,17,0)","v":"Nutzungsbedingungen"},20]
[{"$nulls":25},21]
[{"$nulls":25},22]
[{"$nulls":25},23]
[{"$nulls":11},{"$f":"HLOOKUP($AB$1,$AA$2:$BW$999,14,0)","v":"Beachte:"},{"$nulls":8},{"$f":"U31","v":"Version 1.3_03/17"},{"$nulls":4},24]
[{"$nulls":11},{"$f":"HLOOKUP($AB$1,$AA$2:$BW$999,15,0)","v":"Fittings nach TI 876.600 durch\nErsatzlänge mit einbeziehen."},{"$nulls":13},25]
[null,null,{"$f":"HLOOKUP($AB$1,$AA$2:$BW$999,5,0)","v":"Betriebsdruck"},{"v":7,"d":"7.0"},"[bar]",null,{"$f":"HLOOKUP($AB$1,$AA$2:$BW$999,5,0)","v":"Betriebsdruck"},{"v":7,"d":"7.0"},"[bar]",{"$nulls":11},"Versionsnachverfolgung",{"$nulls":4},26]
[null,null,{"$f":"HLOOKUP($AB$1,$AA$2:$BW$999,6,0)","v":"Volumenstrom"},{"v":50,"d":"50.0"},"[l/s]",null,{"$f":"HLOOKUP($AB$1,$AA$2:$BW$999,6,0)","v":"Volumenstrom"},{"v":100,"d":"100.0"},"[l/s]",{"$nulls":11},"Version 1.0_07/13","Erste Version mit Deutsch, Spanisch, Italienisch, Französisch",{"$nulls":3},27]
[null,null,{"$f":"HLOOKUP($AB$1,$AA$2:$BW$999,7,0)","v":"Rohrlänge"},{"v":100,"d":"100.0"},"[m]",null,{"$f":"HLOOKUP($AB$1,$AA$2:$BW$999,7,0)","v":"Rohrlänge"},{"v":50,"d":"50.0"},"[m]",{"$nulls":11},"Version 1.1_07/13","Aufnahme Türkisch und Hinweismeldung bei Nutzung nach dem 31.12.2015",{"$nulls":3},28]
[null,null,{"$f":"HLOOKUP($AB$1,$AA$2:$BW$999,8,0)","v":"Druckverlust"},0.03,"[bar]",null,{"$f":"HLOOKUP($AB$1,$AA$2:$BW$999,8,0)","v":"Druckverlust"},{"$f":"IFERROR((1.6*1000*((H28/1000)^1.85))*H29/(H31/1000)^5/10^10/H27,\"-\")","v":{"v":0.3073630982187906,"d":"0.31"}},"[bar]",{"$nulls":11},"Version 1.2_09/14","Aufnahme weitere Sprachen",{"$nulls":3},29]
{"$rows_left_out":12}