{"text_format":"3","workbook":"xlsx","n_sheets":6,"sheets":["REHAU RAUPEX","Ringleitung","Strangleitung","Anleitung","Nutzungsbedingungen","Sprachen"],"not_rendered":{"charts":4,"images":3,"defined_names":7},"read":"whole","date_system":"1900"}

{"sheet":"REHAU RAUPEX","index":0,"n_rows":35,"n_cols":19,"rows_kept":35,"merged":[[1,17,2,18],[5,1,5,8],[5,10,9,15],[5,17,8,18],[7,1,9,8]]}
[]
[null,{"$f":"HLOOKUP(S10,Sprachen!A1:T99,2,0)","v":"RAUPEX INDUSTRIEROHRSYSTEM - DRUCKVERLUSTBETRACHTUNG VORLAUF MEDIUM WASSER"},{"$nulls":15},"REHAU AG+Co"]
[]
[]
[]
[null,{"$f":"HLOOKUP(S10,Sprachen!A1:T99,4,0)","v":"… Benennung der Rohranlage"},{"$nulls":8},{"$f":"HLOOKUP(S10,Sprachen!A1:T99,6,0)","v":"… Platz für weitere Notizen."},{"$nulls":6},{"$f":"HLOOKUP(S10,Sprachen!A1:T99,3,0)","v":"Bitte beachten Sie die\nHinweise in den\nNutzungsbedingungen"}]
[]
[null,{"$f":"HLOOKUP(S10,Sprachen!A1:T99,5,0)","v":"Ergebnis:\nDer Gesamtdruckverlust im dargestellten Vorlauf beträgt … bar."}]
[]
[{"$nulls":17},{"$f":"HLOOKUP(S10,Sprachen!A1:T99,76,0)","v":"Sprache wählen"},"Deutsch"]
{"$rows_empty":24}
[null,{"$f":"HLOOKUP(S10,Sprachen!A1:T99,7,0)","v":"Hinweis: Die Rohrnetzskizze kann aus aus jeder anderen Anwendung heraus kopiert und auf dieser Seite eingefügt werden."}]

{"sheet":"Ringleitung","index":1,"n_rows":58,"n_cols":68,"rows_kept":58,"merged":[[2,10,2,13],[4,35,8,38],[6,22,6,28],[11,7,11,9],[12,7,12,9],[15,17,16,17],[15,18,16,18],[15,20,16,20],[18,36,18,37],[48,33,49,38]]}
[]
[]
[]
[]
[{"$nulls":17},{"$f":"HLOOKUP('REHAU RAUPEX'!S10,Sprachen!A1:T99,8,0)","v":"RAUPEX INDUSTRIEROHRSYSTEM - RINGLEITUNG VORLAUF MEDIUM WASSER"},{"$nulls":17},{"$f":"HLOOKUP('REHAU RAUPEX'!S10,Sprachen!A1:T99,3,0)","v":"Bitte beachten Sie die\nHinweise in den\nNutzungsbedingungen"}]
[]
[{"$nulls":17},{"$f":"HLOOKUP('REHAU RAUPEX'!S10,Sprachen!A1:T99,9,0)","v":"Betrachtung Vorlauf"},{"$nulls":4},{"$f":"'REHAU RAUPEX'!B6","v":"… Benennung der Rohranlage"}]
[{"$nulls":17},{"$f":"HLOOKUP('REHAU RAUPEX'!S10,Sprachen!A1:T99,10,0)","v":"Gesamtdruckverlust im Vorlauf < 0,2 bar"}]
[{"$nulls":22},{"$f":"HLOOKUP('REHAU RAUPEX'!S10,Sprachen!A1:T99,11,0)","v":"Wassertemperatur:"},null,null,{"$f":"Strangleitung!Z9","v":20},"[°C]"]
[]
[]
[]
[{"$nulls":56},"lamb0","lamb1","lamb2","lamb3","lamb4","lamb5","lamb6","lamb7","lamb8","lamb9","lamb10","Fehler"]
[]
[]
[{"$nulls":17},{"$f":"HLOOKUP('REHAU RAUPEX'!S10,Sprachen!A1:T99,15,0)","v":"RINGLEITUNG in beiden Fließrichtungen erfassen bis der theoretische hydraulische Nullpunkt definiert ist."},{"$f":"HLOOKUP('REHAU RAUPEX'!S10,Sprachen!A1:T99,16,0)","v":"Teilstrecke"},{"$f":"HLOOKUP('REHAU RAUPEX'!S10,Sprachen!A1:T99,17,0)","v":"RAUPEX Rohr"},{"$f":"HLOOKUP('REHAU RAUPEX'!S10,Sprachen!A1:T99,18,0)","v":"Verbraucher"},{"$f":"HLOOKUP('REHAU RAUPEX'!S10,Sprachen!A1:T99,19,0)","v":"Volumen-\nstrom\nabgehend"},{"$f":"HLOOKUP('REHAU RAUPEX'!S10,Sprachen!A1:T99,20,0)","v":"Volumen-\nstrom\ngesamt"},{"$f":"HLOOKUP('REHAU RAUPEX'!S10,Sprachen!A1:T99,21,0)","v":"Rohr-\nlänge"},{"$f":"HLOOKUP('REHAU RAUPEX'!S10,Sprachen!A1:T99,22,0)","v":"Winkel 90°"},{"$f":"HLOOKUP('REHAU RAUPEX'!S10,Sprachen!A1:T99,23,0)","v":"Winkel 45°"},{"$f":"HLOOKUP('REHAU RAUPEX'!S10,Sprachen!A1:T99,24,0)","v":"T-Stück Abzweig"},{"$f":"HLOOKUP('REHAU RAUPEX'!S10,Sprachen!A1:T99,25,0)","v":"T-Stück Durchgang"},{"$f":"HLOOKUP('REHAU RAUPEX'!S10,Sprachen!A1:T99,26,0)","v":"T-Stück Verteilung"},{"$f":"HLOOKUP('REHAU RAUPEX'!S10,Sprachen!A1:T99,27,0)","v":"T-Stück Vereinigung"},{"$f":"HLOOKUP('REHAU RAUPEX'!S10,Sprachen!A1:T99,28,0)","v":"Redu-\nzierung"},"Absperr-schieber","Kugelhahn",{"$f":"HLOOKUP('REHAU RAUPEX'!S10,Sprachen!A1:T99,29,0)","v":"Rohr-\nreibung"},{"$f":"HLOOKUP('REHAU RAUPEX'!S10,Sprachen!A1:T99,30,0)","v":"Reynolds-\nzahl"},{"$f":"HLOOKUP('REHAU RAUPEX'!S10,Sprachen!A1:T99,31,0)","v":"Geschwin-\ndigkeit"},{"$f":"HLOOKUP('REHAU RAUPEX'!S10,Sprachen!A1:T99,32,0)","v":"Druckverlust Formteile"},{"$f":"HLOOKUP('REHAU RAUPEX'!S10,Sprachen!A1:T99,33,0)","v":"Druckverlust Rohr"},{"$f":"HLOOKUP('REHAU RAUPEX'!S10,Sprachen!A1:T99,34,0)","v":"Druckverlust Formteil + Rohr"},{"$f":"HLOOKUP('REHAU RAUPEX'!S10,Sprachen!A1:T99,34,0)","v":"Druckverlust Formteil + Rohr"},{"$f":"HLOOKUP('REHAU RAUPEX'!S10,Sprachen!A1:T99,35,0)","v":"Druckverlust Gruppierung kommuliert"}]
[{"$nulls":19},"SDR 11",null,"[l/min]","[l/min]","[m]",1.3,0.5,1.3,0.3,1.5,1.3,0.4,0.5,0.1,"[Pa/m]","Re","[m/s]","[Pa]","[Pa]","[Pa]","[bar]","[bar]"]
[]
[{"$nulls":50},"Rohrauswahl pro Zeile",null,null,"k=","di=","Re=","lamb0","lamb1","lamb2","lamb3","lamb4","lamb5","lamb6","lamb7","lamb8","lamb9","lamb10"]
[{"$nulls":17},"RINGLEITUNG LINKS",{"$nulls":4},{"$f":"IF(OR(V21=0,V20=0),V20,V20+W21)","v":0},{"$nulls":10},{"$f":"IFERROR(BO20*$BG$51*(AJ20^2)/(AY20-2*AZ20)/2/10^-3,0)","v":0},{"$f":"IFERROR(AJ20*(AY20-2*AZ20)/$BG$53/1000,0)","v":0},{"$f":"IFERROR((W20/60)*4000/((AY20-2*AZ20)^2)/PI(),0)","v":{"v":0,"d":"0.00"}},{"$f":"(Y20*$Y$17*($BG$51/2)*AJ20^2)+(Z20*$Z$17*($BG$51/2)*AJ20^2)+(AA20*$AA$17*($BG$51/2)*AJ20^2)+(AB20*$AB$17*($BG$51/2)*AJ20^2)+(AC20*$AC$17*($BG$51/2)*AJ20^2)+(AD20*$AD$17*($BG$51/2)*AJ20^2)+(AE20*$AE$17*($BG$51/2)*AJ20^2)+(AF20*$L$12*($BG$51/2)*AJ20^2)+(AG20*$L$13*($BG$51/2)*AJ20^2)","v":0},{"$f":"AH20*X20","v":0},{"$f":"AK20+AL20","v":0},{"$f":"(AK20+AL20)/100000","v":{"v":0,"d":"0.00"}},{"$f":"IF(V20=0,0,IF(AO19=0,AN20,(AN20+AO19)))","v":{"v":0,"d":"0.000"}},{"$nulls":9},{"$f":"T20","v":0},{"$f":"IFERROR(LOOKUP(AY20,$BB$49:$BC$58),0)","v":0},null,{"$f":"$BG$52","v":{"v":0.007,"d":"0.007 "}},{"$f":"AY20-AZ20-AZ20","v":{"v":0,"d":"0.0"}},{"$f":"AI20","v":0},{"v":0.1,"d":"0.1 "},{"$f":"(-2*LOG(((BB20/BC20)/3.71)+(2.51/(BD20*(BE20)^0.5))))^(-2)","v":{"$error":"#DIV/0!"}},{"$f":"(-2*LOG(((BB20/BC20)/3.71)+(2.51/(BD20*(BF20)^0.5))))^(-2)","v":{"$error":"#DIV/0!"}},{"$f":"(-2*LOG(((BB20/BC20)/3.71)+(2.51/(BD20*(BG20)^0.5))))^(-2)","v":{"$error":"#DIV/0!"}},{"$f":"(-2*LOG(((BB20/BC20)/3.71)+(2.51/(BD20*(BH20)^0.5))))^(-2)","v":{"$error":"#DIV/0!"}},{"$f":"(-2*LOG(((BB20/BC20)/3.71)+(2.51/(BD20*(BI20)^0.5))))^(-2)","v":{"$error":"#DIV/0!"}},{"$f":"(-2*LOG(((BB20/BC20)/3.71)+(2.51/(BD20*(BJ20)^0.5))))^(-2)","v":{"$error":"#DIV/0!"}},{"$f":"(-2*LOG(((BB20/BC20)/3.71)+(2.51/(BD20*(BK20)^0.5))))^(-2)","v":{"$error":"#DIV/0!"}},{"$f":"(-2*LOG(((BB20/BC20)/3.71)+(2.51/(BD20*(BL20)^0.5))))^(-2)","v":{"$error":"#DIV/0!"}},{"$f":"(-2*LOG(((BB20/BC20)/3.71)+(2.51/(BD20*(BM20)^0.5))))^(-2)","v":{"$error":"#DIV/0!"}},{"$f":"(-2*LOG(((BB20/BC20)/3.71)+(2.51/(BD20*(BN20)^0.5))))^(-2)","v":{"$error":"#DIV/0!"}}]
{"$rows_left_out":39}
{"sheet":"Strangleitung","index":2,"n_rows":58,"n_cols":68,"rows_kept":58,"merged":[[2,10,2,13],[4,35,8,38],[6,22,6,28],[11,7,11,9],[12,7,12,9],[15,17,16,17],[15,18,16,18],[15,20,16,20],[18,36,18,37],[48,33,49,38]]}
[]
[]
[]
[]
[{"$nulls":17},{"$f":"HLOOKUP('REHAU RAUPEX'!S10,Sprachen!A1:T99,38,0)","v":"RAUPEX INDUSTRIEROHRSYSTEM - STRANGLEITUNGEN VORLAUF MEDIUM WASSER"},{"$nulls":17},{"$f":"HLOOKUP('REHAU RAUPEX'!S10,Sprachen!A1:T99,3,0)","v":"Bitte beachten Sie die\nHinweise in den\nNutzungsbedingungen"}]
[]
[{"$nulls":17},{"$f":"HLOOKUP('REHAU RAUPEX'!S10,Sprachen!A1:T99,9,0)","v":"Betrachtung Vorlauf"},{"$nulls":4},{"$f":"'REHAU RAUPEX'!B6","v":"… Benennung der Rohranlage"}]
[{"$nulls":17},{"$f":"HLOOKUP('REHAU RAUPEX'!S10,Sprachen!A1:T99,10,0)","v":"Gesamtdruckverlust im Vorlauf < 0,2 bar"}]
[{"$nulls":22},{"$f":"HLOOKUP('REHAU RAUPEX'!S10,Sprachen!A1:T99,11,0)","v":"Wassertemperatur:"},null,null,20,"[°C]"]
[]
[]
[]
[{"$nulls":56},"lamb0","lamb1","lamb2","lamb3","lamb4","lamb5","lamb6","lamb7","lamb8","lamb9","lamb10","Fehler"]
[]
[]
[{"$nulls":17},{"$f":"HLOOKUP('REHAU RAUPEX'!S10,Sprachen!A1:T99,39,0)","v":"STRANGLEITUNGEN erfassen, durch Leerzeilen sind gruppierte Teilbetrachtungen möglich."},{"$f":"HLOOKUP('REHAU RAUPEX'!S10,Sprachen!A1:T99,16,0)","v":"Teilstrecke"},{"$f":"HLOOKUP('REHAU RAUPEX'!S10,Sprachen!A1:T99,17,0)","v":"RAUPEX Rohr"},{"$f":"HLOOKUP('REHAU RAUPEX'!S10,Sprachen!A1:T99,18,0)","v":"Verbraucher"},{"$f":"HLOOKUP('REHAU RAUPEX'!S10,Sprachen!A1:T99,19,0)","v":"Volumen-\nstrom\nabgehend"},{"$f":"HLOOKUP('REHAU RAUPEX'!S10,Sprachen!A1:T99,20,0)","v":"Volumen-\nstrom\ngesamt"},{"$f":"HLOOKUP('REHAU RAUPEX'!S10,Sprachen!A1:T99,21,0)","v":"Rohr-\nlänge"},{"$f":"HLOOKUP('REHAU RAUPEX'!S10,Sprachen!A1:T99,22,0)","v":"Winkel 90°"},{"$f":"HLOOKUP('REHAU RAUPEX'!S10,Sprachen!A1:T99,23,0)","v":"Winkel 45°"},{"$f":"HLOOKUP('REHAU RAUPEX'!S10,Sprachen!A1:T99,24,0)","v":"T-Stück Abzweig"},{"$f":"HLOOKUP('REHAU RAUPEX'!S10,Sprachen!A1:T99,25,0)","v":"T-Stück Durchgang"},{"$f":"HLOOKUP('REHAU RAUPEX'!S10,Sprachen!A1:T99,26,0)","v":"T-Stück Verteilung"},{"$f":"HLOOKUP('REHAU RAUPEX'!S10,Sprachen!A1:T99,27,0)","v":"T-Stück Vereinigung"},{"$f":"HLOOKUP('REHAU RAUPEX'!S10,Sprachen!A1:T99,28,0)","v":"Redu-\nzierung"},"Absperr-schieber","Kugelhahn",{"$f":"HLOOKUP('REHAU RAUPEX'!S10,Sprachen!A1:T99,29,0)","v":"Rohr-\nreibung"},{"$f":"HLOOKUP('REHAU RAUPEX'!S10,Sprachen!A1:T99,30,0)","v":"Reynolds-\nzahl"},{"$f":"HLOOKUP('REHAU RAUPEX'!S10,Sprachen!A1:T99,31,0)","v":"Geschwin-\ndigkeit"},{"$f":"HLOOKUP('REHAU RAUPEX'!S10,Sprachen!A1:T99,32,0)","v":"Druckverlust Formteile"},{"$f":"HLOOKUP('REHAU RAUPEX'!S10,Sprachen!A1:T99,33,0)","v":"Druckverlust Rohr"},{"$f":"HLOOKUP('REHAU RAUPEX'!S10,Sprachen!A1:T99,34,0)","v":"Druckverlust Formteil + Rohr"},{"$f":"HLOOKUP('REHAU RAUPEX'!S10,Sprachen!A1:T99,34,0)","v":"Druckverlust Formteil + Rohr"},{"$f":"HLOOKUP('REHAU RAUPEX'!S10,Sprachen!A1:T99,35,0)","v":"Druckverlust Gruppierung kommuliert"}]
[{"$nulls":19},"SDR 11",null,"[l/min]","[l/min]","[m]",1.3,0.5,1.3,0.3,1.5,1.3,0.4,0.5,0.1,"[Pa/m]","Re","[m/s]","[Pa]","[Pa]","[Pa]","[bar]","[bar]"]
[]
[{"$nulls":50},"Rohrauswahl pro Zeile",null,null,"k=","di=","Re=","lamb0","lamb1","lamb2","lamb3","lamb4","lamb5","lamb6","lamb7","lamb8","lamb9","lamb10"]
[{"$nulls":17},"Rohrabschnitt","H1",32,"Z1",8,{"$f":"IF(OR(V21=0,V20=0),V20,V20+W21)","v":40},{"v":5,"d":"5.0"},{"$nulls":3},1,{"$nulls":5},{"$f":"IFERROR(BO20*$BG$51*(AJ20^2)/(AY20-2*AZ20)/2/10^-3,0)","v":{"v":694.85249287408,"d":"695"}},{"$f":"IFERROR(AJ20*(AY20-2*AZ20)/$BG$53/1000,0)","v":{"v":32077.613483735753,"d":"32078"}},{"$f":"IFERROR((W20/60)*4000/((AY20-2*AZ20)^2)/PI(),0)","v":{"v":1.2365630836734094,"d":"1.24"}},{"$f":"(Y20*$Y$17*($BG$51/2)*AJ20^2)+(Z20*$Z$17*($BG$51/2)*AJ20^2)+(AA20*$AA$17*($BG$51/2)*AJ20^2)+(AB20*$AB$17*($BG$51/2)*AJ20^2)+(AC20*$AC$17*($BG$51/2)*AJ20^2)+(AD20*$AD$17*($BG$51/2)*AJ20^2)+(AE20*$AE$17*($BG$51/2)*AJ20^2)+(AF20*$L$12*($BG$51/2)*AJ20^2)+(AG20*$L$13*($BG$51/2)*AJ20^2)","v":{"v":228.98734182303733,"d":"229"}},{"$f":"AH20*X20","v":{"v":3474.2624643704,"d":"3474"}},{"$f":"AK20+AL20","v":{"v":3703.249806193437,"d":"3703"}},{"$f":"(AK20+AL20)/100000","v":{"v":0.03703249806193437,"d":"0.04"}},{"$f":"IF(V20=0,0,IF(AO19=0,AN20,(AN20+AO19)))","v":{"v":0.03703249806193437,"d":"0.037"}},{"$nulls":9},{"$f":"T20","v":32},{"$f":"IFERROR(LOOKUP(AY20,$BB$49:$BC$58),0)","v":2.9},null,{"$f":"$BG$52","v":{"v":0.007,"d":"0.007 "}},{"$f":"AY20-AZ20-AZ20","v":{"v":26.200000000000003,"d":"26.2"}},{"$f":"AI20","v":{"v":32077.613483735753,"d":"32078"}},{"v":0.1,"d":"0.1 "},{"$f":"(-2*LOG(((BB20/BC20)/3.71)+(2.51/(BD20*(BE20)^0.5))))^(-2)","v":{"v":0.020459701236441332,"d":"0.0205 "}},{"$f":"(-2*LOG(((BB20/BC20)/3.71)+(2.51/(BD20*(BF20)^0.5))))^(-2)","v":{"v":0.024288387415353285,"d":"0.0243 "}},{"$f":"(-2*LOG(((BB20/BC20)/3.71)+(2.51/(BD20*(BG20)^0.5))))^(-2)","v":{"v":0.023800027160217042,"d":"0.0238 "}},{"$f":"(-2*LOG(((BB20/BC20)/3.71)+(2.51/(BD20*(BH20)^0.5))))^(-2)","v":{"v":0.023856816466915915,"d":"0.0239 "}},{"$f":"(-2*LOG(((BB20/BC20)/3.71)+(2.51/(BD20*(BI20)^0.5))))^(-2)","v":{"v":0.02385013885632106,"d":"0.0239 "}},{"$f":"(-2*LOG(((BB20/BC20)/3.71)+(2.51/(BD20*(BJ20)^0.5))))^(-2)","v":{"v":0.023850923026093162,"d":"0.0239 "}},{"$f":"(-2*LOG(((BB20/BC20)/3.71)+(2.51/(BD20*(BK20)^0.5))))^(-2)","v":{"v":0.023850830924838706,"d":"0.0239 "}},{"$f":"(-2*LOG(((BB20/BC20)/3.71)+(2.51/(BD20*(BL20)^0.5))))^(-2)","v":{"v":0.023850841741997145,"d":"0.0239 "}},{"$f":"(-2*LOG(((BB20/BC20)/3.71)+(2.51/(BD20*(BM20)^0.5))))^(-2)","v":{"v":0.02385084047153493,"d":"0.0239 "}},{"$f":"(-2*LOG(((BB20/BC20)/3.71)+(2.51/(BD20*(BN20)^0.5))))^(-2)","v":{"v":0.023850840620749148,"d":"0.02385 "}}]
{"$rows_left_out":39}
{"sheet":"Anleitung","index":3,"n_rows":20,"n_cols":5,"rows_kept":20}
[]
[]
[]
[null,null,{"$f":"HLOOKUP('REHAU RAUPEX'!S10,Sprachen!A1:T99,52,0)","v":"ANLEITUNG BERECHNUNGSTOOL RAUPEX INDUSTRIEROHRSYSTEM"}]
[]
[null,null,{"$f":"HLOOKUP('REHAU RAUPEX'!S10,Sprachen!A1:T99,53,0)","v":"DRUCKVERLUSTBETRACHTUNG IM VORLAUF - MEDIUM WASSER"},null,"Version 01.2021          "]
[]
[]
[null,null,{"$f":"HLOOKUP('REHAU RAUPEX'!S10,Sprachen!A1:T99,54,0)","v":"Beispielanlage für den hydraulischen Vorlauf. \nBeginnend nehmen wir eine durchgehende Rohrdimension von 32 x 2,9 mm an."},{"$f":"HLOOKUP('REHAU RAUPEX'!S10,Sprachen!A1:T99,55,0)","v":"Die Rohrnetzskizze kann aus jeder anderen Anwendung heraus kopiert und auf den ersten drei Seiten im Berechnungstool eingefügt werden.\nAlternativ kann die Rohrnetzskizze auch durch Einzellinien erstellt werden."}]
[null,null,{"$f":"HLOOKUP('REHAU RAUPEX'!S10,Sprachen!A1:T99,56,0)","v":"Erstelle eine Skizze vom Vorlauf und beschrifte die Leitungsabschnitte und die Verbraucher."},{"$f":"HLOOKUP('REHAU RAUPEX'!S10,Sprachen!A1:T99,57,0)","v":"Die Beschriftungen könnten wie folgt gewählt werden:\n          Hx Hauptleitungsabschnitt\n          Rx Ringleitungsabschnitt\n          Vx Verteilleitungsabschnitt\n          Zx  Verbraucher (Schweiss-)Zange\n          Tx   T-Stück\nEin Leitungsabschnitt wird dadurch definiert, dass er nur am Anfang und am Ende eine Volumenstromteilung oder -zusammenführung aufzeigt (Ausnahmen siehe Skizze H1 und V1). Stichleitungen zum Einzelverbraucher und deren T-Stücke können bei Bedarf gekennzeichnet werden. "}]
[null,null,{"$f":"HLOOKUP('REHAU RAUPEX'!S10,Sprachen!A1:T99,58,0)","v":"Ermittlung hydraulischer Nullpunkt.\n(Dieser Schritt ist nur erforderlich, wenn die Anlage eine Ringleitung enthält.)"},{"$f":"HLOOKUP('REHAU RAUPEX'!S10,Sprachen!A1:T99,59,0)","v":"Als Zwischenziel wollen wir nun die ideale Verteilung des Volumenstrom in der Ringleitung ermitteln, welche sich in unserem Beispiel bei T1 beginnend nach rechts und links aufteilt und im hydraulischen Nullpunkt wieder vereint. Der hydraulische Nullpunkt kann ein T-Stück Tx oder ein Verbraucher Zx sein, wir vermuten den Punkt T2 und öffnen das Tabellenblatt Ringleitung.\nIm oberen Feld nun die links laufenden Ringleitungsabschnitte R1 und R2 und im unteren Feld die rechtslaufenden Ringleitungsabschnitte R5, R4 und R3 eintragen. Für jeden Ringleitungsabschnitt immer nur den Volumenstrom eingeben, welcher am Ende vom Verbraucher Zx abgenommen oder am T-Stück Tx abgegeben wird. Das obere und untere Feld endet in unserer Annahme jeweils im Punkt T2. Wir verteilen den Volumenstrom nun nach rechts und links im Punkt T2 bis die Seiten im Kreisdiagramm gleich groß sind. Nun kennen wir die ideale Verteilung des Volumenstrom in der Ringleitung für die weitere Berechnung."}]
[null,null,{"$f":"HLOOKUP('REHAU RAUPEX'!S10,Sprachen!A1:T99,60,0)","v":"Druckverlust hydraulischer Vorlauf (kritischer Pfad) der Beispielanlage."},{"$f":"HLOOKUP('REHAU RAUPEX'!S10,Sprachen!A1:T99,61,0)","v":"Vom Einspeisepunkt ausgehend, suchen wir nun den Verbraucher mit dem größten Druckverlust (auch kritischer Pfad genannt). In unserem Beispiel können wir die Rohrleitungsstrecke zwischen HIP und Z3 annehmen.\nDieser Rohrleitungsweg ist nicht immer gleich erkennbar. Häufig enthält dieser die größte Anzahl Verbraucher und/oder längsten Rohrleitungsweg. Auch kann dieser Weg durch Abschnitte einer Ringleitung führen, deshalb wurde die Ringleitung bereits berechnet. Wir öffnen das Tabellenblatt Strangleitung.\nNun tragen wir die Rohrleitungsabschnitte H1, H2, R1 und R2 bis Z3 in die Felder ein. Für jeden Rohrleitungsabschnitt immer nur den Volumenstrom eingeben, welcher am Ende vom Verbraucher Zx abgenommen oder am T-Stück Tx abgegeben wird. Um die Verteilleitung V1 zu berücksichtigen, muss diese nach einer Leerzeile separat erfasst werden. Der Druckverlust im hydraulischen Vorlauf ist ermittelt. Bitte bachten Sie hierzu auch die Hinweise in den Nutzungsbedingungen!"}]
[]
[null,null,{"$f":"HLOOKUP('REHAU RAUPEX'!S10,Sprachen!A1:T99,62,0)","v":"Regel Druckverlust < 0,2bar"},{"$f":"HLOOKUP('REHAU RAUPEX'!S10,Sprachen!A1:T99,63,0)","v":"Mit diesem Berechnungstool wird nur der Druckverlust im Vorlauf der Rohrleitungsanlage berechnet, welcher im Ergebnis < 0,2 bar sein muss. Wird der Rücklauf identisch ausgeführt, kann dieser Wert verdoppelt werden, um auf den Gesamtdruckverlust der Rohrleitungsanlage zu schließen, welcher im Ergebnis < 0,4 bar sein muss."}]
[null,null,{"$f":"HLOOKUP('REHAU RAUPEX'!S10,Sprachen!A1:T99,64,0)","v":"Regel zur Rohrdimension"},{"$f":"HLOOKUP('REHAU RAUPEX'!S10,Sprachen!A1:T99,65,0)","v":"Für die erste Berechnung ist eine durchgehende Rohrdimension von 32x2,9 mm anzunehmen. Stellt sich der geforderte Druckverlust < 0,2 bar ein, sind häufig keine weiteren Optimierungen erforderlich. Wird dieser Druckverlust überschritten, können folgende Optimierungen eine Lösungen darstellen."}]
[null,null,{"$f":"HLOOKUP('REHAU RAUPEX'!S10,Sprachen!A1:T99,66,0)","v":"Regel zur Optimierung mittels Dimensionswahl"},{"$f":"HLOOKUP('REHAU RAUPEX'!S10,Sprachen!A1:T99,67,0)","v":"Wird der geforderte Druckverlust < 0,2 bar überschritten, kann durch Vergößerung der Dimension der ersten Rohrabschnitte von der HIP ausgehend die Fließgeschwindigkeit und damit der Druckverlust wieder reduziert werden."}]
[null,null,{"$f":"HLOOKUP('REHAU RAUPEX'!S10,Sprachen!A1:T99,68,0)","v":"Regel zur Optimierung mittels Ringleitung"},{"$f":"HLOOKUP('REHAU RAUPEX'!S10,Sprachen!A1:T99,69,0)","v":"Wird der geforderte Druckverlust < 0,2 bar überschritten, kann häufig durch zusätzliche Ergänzung eines Ringleitungsschluss der Volumenstrom geteilt und der Druckverlust wieder reduziert werden."}]
[null,null,{"$f":"HLOOKUP('REHAU RAUPEX'!S10,Sprachen!A1:T99,70,0)","v":"Regel zur Optimierung mittels Position der HIP"},{"$f":"HLOOKUP('REHAU RAUPEX'!S10,Sprachen!A1:T99,71,0)","v":"Wird der geforderte Druckverlust < 0,2 bar überschritten, kann durch Positionsänderung der HIP im Mittelfeld der Rohrleitungsanlage der Druckverlust wieder reduziert werden. Von dieser Position aus können mehrere Stränge die Verbraucher bedienen, was bei gleicher Rohrdimension häufig hydraulisch sinnvoller ist."}]
[null,null,{"$f":"HLOOKUP('REHAU RAUPEX'!S10,Sprachen!A1:T99,72,0)","v":"Hinweisampel \nDruckverlust"},{"$f":"HLOOKUP('REHAU RAUPEX'!S10,Sprachen!A1:T99,73,0)","v":"Auf den Berechnungsblättern \"Ringleitung\" und \"Strangleitung\" wird unten rechts jeweils das Ergebnis zum Druckverlust angegeben. Übersteigt dieser Wert 0,2 bar, wird das Ergebnis ROT hinterlegt um auf diesen Fehler hinzuweisen."}]
[null,null,{"$f":"HLOOKUP('REHAU RAUPEX'!S10,Sprachen!A1:T99,74,0)","v":"Hinweisampel  Fließgeschwindigkeit"},{"$f":"HLOOKUP('REHAU RAUPEX'!S10,Sprachen!A1:T99,75,0)","v":"Auf den Berechnungsblättern \"Ringleitung\" und \"Strangleitung\" werden Fließgeschwindigkeit zwischen 1,5  bis 2,0 m/s automatisch ORANGE und Fließgeschwindigkeiten ab 2,0 m/s automatisch ROT hinterlegt. Dies kann als Hinweis und Aufforderung zur Prüfung verstanden werden."}]
{"$rows_left_out":1}
{"sheet":"Nutzungsbedingungen","index":4,"n_rows":52,"n_cols":3,"rows_kept":52,"merged":[[7,2,16,57],[17,2,17,57],[18,2,24,57],[25,2,28,57],[30,2,34,57],[36,2,42,57],[43,2,44,57],[45,2,49,57],[51,2,55,57]]}
[]
[]
[]
[null,null,{"$f":"HLOOKUP('REHAU RAUPEX'!S10,Sprachen!A1:T99,43,0)","v":"NUTZUNGSBEDINGUNGEN"}]
[]
[null,null,{"$f":"HLOOKUP('REHAU RAUPEX'!S10,Sprachen!A1:T99,44,0)","v":"BERECHNUNGSTOOL RAUPEX INDUSTRIEROHRSYSTEM - MEDIUM WASSER"}]
[]
[null,null,{"$f":"HLOOKUP('REHAU RAUPEX'!S10,Sprachen!A1:T99,45,0)","v":"Mit diesem Berechnungstool können für die Anwendung Wassertransport, in Verbindung mit dem RAUPEX INDUSTRIEROHRSYSTEM der Rohrreihe SDR11 und Schiebehülsenverbindung, Druckverlustbetrachtungen innerhalb des RAUPEX-Systems durchgeführt werden. Bauseitige Komponenten außerhalb des RAUPEX-Systems können in die Betrachtung nicht einbezogen werden. Für die Betrachtung der jeweiligen Verlegeart, zum Beispiel im Ring oder im Strang, bietet das Berechnungstool unterschiedliche Tabellenblätter an, welche durch den Benutzer eigenverantwortlich auszuwählen, zu kombinieren und auf den jeweiligen Anwendungsfall anzuwenden sind. Die sich ergebenden Teilergebnisse werden durch den Benutzer interpretiert sowie das Gesamtergebnis abgeleitet."}]
{"$rows_empty":10}
[null,null,{"$f":"HLOOKUP('REHAU RAUPEX'!S10,Sprachen!A1:T99,46,0)","v":"Das Berechnungstool wendet unterschiedliche Formeln, Konstanten und Variablen an, welche nicht immer auf die jeweiligen Betriebsparameter angepasst werden können. Der sich hierbei ergebende Fehler wir durch die Kumulation der Teilabschnitte pro Tabellenzeile noch vergrößert. Auch können sich durch die Interpretation von Formteilen oder Fehlern in der Berechnung weitere Abweichungen ergeben."}]
[]
[]
[]
[]
[]
[]
[null,null,{"$f":"HLOOKUP('REHAU RAUPEX'!S10,Sprachen!A1:T99,47,0)","v":"Das Ergebnis ist damit ausschließlich eine ungefähre Näherung, für deren praktische Genauigkeit und Anwendbarkeit wir im Einzelfall keine Gewähr übernehmen können."}]
[]
[]
[]
{"$rows_left_out":17}
{"sheet":"Sprachen","index":5,"n_rows":76,"n_cols":5,"rows_kept":76,"hidden":true}
["Deutsch","English","Español","Italiano","Chinese"]
["RAUPEX INDUSTRIEROHRSYSTEM - DRUCKVERLUSTBETRACHTUNG VORLAUF MEDIUM WASSER","RAUPEX INDUSTRIAL PIPING SYSTEM - PRESSURE LOSS OBSERVATION, FLOW, FLUID: WATER","SISTEMA TUBERIA INDUSTRIAL RAUPEX - VISUALIZACION PERDIDA DE CARGA PARA IDA FLUIDO AGUA","RAUPEX SISTEMA TUBI INDUSTRIALI - CALCOLO PERDITE DI CARICO FLUIDO DI PROCESSO ACQUA","RAUPEX工业管路系统 - 压力损失计算表 (流体: 水)"]
["Bitte beachten Sie die\nHinweise in den\nNutzungsbedingungen","Please note the\ninformation in our\nterms of use ","Tenga en cuenta la\ninformación en los\ntérminos de uso","Si prega di osservare\nle istruzioni nei termini\ndi utilizzo","请注意\n我们使用条款中的信息"]
["… Benennung der Rohranlage","… description of the pipe system","Calificación","Denominazione","有关管道系统的描述……"]
["Ergebnis:\nDer Gesamtdruckverlust im dargestellten Vorlauf beträgt … bar.","Result:\nThe total pressure loss in the flow shown is ... bar.","Resultado:\nLa pérdida total de carga en la impulsion viene dada por ... bar.","Risultato:\nLa perdita di carico totale in mandata è data da … bar.","结果（示例）:\n本次计算管段为供水管，所有供水管计算管段的流体总压力损失为……bar。\n"]
["… Platz für weitere Notizen.","... space for further notes.","... espacio para más comentarios.","… spazio per altre notizie.","…其它补充说明。"]
["Hinweis: Die Rohrnetzskizze kann aus aus jeder anderen Anwendung heraus kopiert und auf dieser Seite eingefügt werden.","Note: The pipe network sketch can be copied from any other application and inserted on this page.","Nota: El esquema de red de tuberías puede ser incluido de otras aplicaciones y pegarse en esta página.","Istruzioni: Lo schema della rete di tubazioni può essere da qualsiasi altra applicazione ed incollato in questa pagina.","注意: 管网示意图可以从其他任何应用程序复制，再插入本页面。"]
["RAUPEX INDUSTRIEROHRSYSTEM - RINGLEITUNG VORLAUF MEDIUM WASSER","RAUPEX INDUSTRIAL PIPING SYSTEM - RING MAIN, FLOW, FLUID: WATER","SISTEMA TUBERIA INDUSTRIAL RAUPEX - SISTEMA EN ANILLO PARA IDA FLUIDO AGUA","RAUPEX SISTEMA TUBI INDUSTRIALI - SISTEMA AD ANELLO FLUIDO DI PROCESSO ACQUA","RAUPEX工业管路系统 - 主环路部分 (流体: 水)"]
["Betrachtung Vorlauf","Observation Flow","Vista ida","Valutazione Mandata","观察流体："]
["Gesamtdruckverlust im Vorlauf < 0,2 bar","Total pressure loss, flow < 0,2 bar","Perdida de carga tota en ida < 0,2 bar","Perdita di carico totale in mandata<0,2 bar","流体总压力损失 < 0.2bar"]
["Wassertemperatur:","water temperature:","Temperatura Agua:","Temperatura dell'acqua:","水温:"]
["RINGLEITUNG LINKS","RING MAIN LEFT","Sistema en anillo izq.","CIRCUITO ANELLO DI SX","主环路左侧部分"]
["RINGLEITUNG RECHTS","RING MAIN RIGHT","Sistema en anillo dcha.","CIRCUITO ANELLO DI DX","主环路右侧部分"]
["Ringleitungsabschnitt","Ring main section","Sección sistema anillo ","Sezione sistema ad anello","主要环段"]
["RINGLEITUNG in beiden Fließrichtungen erfassen bis der theoretische hydraulische Nullpunkt definiert ist.","RING MAIN, captured in both flow directions, until the theoretical,hydraulic zero-point is defined, ","Introducir sistema en anillo en ambas direcciones hasta encontrar el punto cero teórico hidraúlico.","Regolare Luhgezza TUBO DELL'ANELLO in entrambe le direzioni di flusso fino a definire punto zero/nullo teorico.\n","主环路，在两个方向上进行流动，直到汇合至理论上定义的压力零点。"]
["Teilstrecke","section","Sección","Tratto","管段"]
["RAUPEX Rohr","RAUPEX pipe","Tubo RAUPEX","Tubo RAUPEX","RAUPEX管"]
["Verbraucher","consumer","Consumidor","Utilizzatore","使用点"]
["Volumen-\nstrom\nabgehend","volume\nflow\noutgoing","Volumen\nde flujo\nsaliente","Portata\nuscente","出口\n体积流量"]
["Volumen-\nstrom\ngesamt","volume\nflow\ntotal","Volumen\nde flujo\ntotal","Portata\nTotale","管段\n总体积流量"]
{"$rows_left_out":56}