{"text_format":"3","workbook":"xlsx","n_sheets":3,"sheets":["Nutzungsbedingungen","RAUPEX","Anlage"],"not_rendered":{"images":2,"defined_names":4},"read":"whole","date_system":"1900"}

{"sheet":"Nutzungsbedingungen","index":0,"n_rows":11,"n_cols":22,"rows_kept":11,"merged":[[3,1,3,9],[4,1,4,9],[5,1,5,9],[6,1,6,9],[7,1,7,9],[8,1,8,9],[9,1,9,9]]}
[{"$nulls":21},{"$f":"HLOOKUP(RAUPEX!$AB$1,RAUPEX!$AA$2:$AV$999,33,0)","v":"Nutzungsbedingungen"}]
[]
[]
[null,{"$f":"HLOOKUP(RAUPEX!$AB$1,RAUPEX!$AA$2:$AV$999,36,0)","v":"REHAU SOFTWARE INDUSTRIEROHRSYSTEM RAUPEX"}]
[null,{"$f":"HLOOKUP(RAUPEX!$AB$1,RAUPEX!$AA$2:$AV$999,37,0)","v":"Haftungsausschluss"}]
[null,{"$f":"HLOOKUP(RAUPEX!$AB$1,RAUPEX!$AA$2:$AV$999,38,0)","v":"Copyright © 2013"}]
[null,{"$f":"HLOOKUP(RAUPEX!$AB$1,RAUPEX!$AA$2:$AV$999,39,0)","v":"Alle Daten innerhalb dieser Webseite/Software sind urheberrechtlich geschützt und dürfen nicht ohne Zustimmung der Rechteinhaber verwendet werden. Die durch das Urheberrecht begründeten Rechte, insbesondere die der Übersetzung, des Nachdruckes, der Entnahme von Abbildungen, der Funksendungen, der Wiedergabe auf fotomechanischem oder ähnlichem Wege und der Speicherung in Datenverarbeitungsanlagen, bleiben vorbehalten."}]
[null,{"$f":"HLOOKUP(RAUPEX!$AB$1,RAUPEX!$AA$2:$AV$999,40,0)","v":"Kontakt: info@rehau.com "}]
[null,{"$f":"HLOOKUP(RAUPEX!$AB$1,RAUPEX!$AA$2:$AV$999,41,0)","v":"Datenschutz: Alle innerhalb dieser Webseite vom Anwender eingegebenen und verarbeiteten Daten werden vertraulich gem. § 5 BDSG behandelt und nicht an Dritte weitergegeben. Die Daten werden nur zur Bearbeitung der Anfragen benutzt. "}]
[null,{"$f":"HLOOKUP(RAUPEX!$AB$1,RAUPEX!$AA$2:$AV$999,42,0)","v":"Die Webseite/Software wird von den Herausgebern kostenlos zur Verfügung gestellt. Die Herausgeber übernehmen keinerlei Gewähr für die Aktualität, Korrektheit, zu Grunde gelegte Berechnungsformeln, Berechnungsergebnisse, Vollständigkeit oder Qualität der bereitgestellten Informationen. Haftungsansprüche gegen die Herausgeber und Autoren, die sich auf Schäden materieller oder ideeler Art beziehen, welche durch die Nutzung der dargebotenen Informationen bzw. durch Nutzung fehlerhafter oder unvollständiger Informationen verursacht wurden, sind grundsätzlich ausgeschlossen, sofern seitens der Herausgeber und Autoren kein nachweislich vorsätzliches oder grob fahrlässiges Verschulden vorliegt. Die Herausgeber behalten es sich ausdrücklich vor, Teile der Seiten oder den gesamten Inhalt ohne gesonderte Ankündigung zu verändern, zu ergänzen oder die Veröffentlichung zeitweise oder endgültig einzustellen. Aus der Veröffentlichung kann nicht entnommen werden, dass die verwendeten Bezeichnungen frei von Rechten Dritter sind. Sofern auf Verweisziele („Links“) direkt oder indirekt verwiesen wird, die außerhalb des Verantwortungsbereichs des Herausgebers/Autoren liegen, haften diese allenfalls dann, wenn sie von den Inhalten Kenntnis hatten, und es ihnen technisch möglich und zumutbar wäre, die Nutzung im Falle rechtswidriger Inhalte zu verhindern. Für darüber hinausgehende Inhalte und insbesondere für Schäden, die aus der Nutzung oder Nichtnutzung solcherart dargebotener Informationen entstehen, haftet allein der Anbieter dieser Seiten, nicht derjenige, der über Links auf die jeweilige Veröffentlichung lediglich verweist. Dieser Haftungsausschluss ist als Teil des Internetangebots dieser Seite / dieses Softwareangebots zu betrachten. Sofern Teile oder einzelne Formulierungen dieses Textes der geltenden Rechtslage nicht, nicht mehr oder nicht vollständig entsprechen sollten, bleiben die übrigen Teile des Dokuments in ihrem Inhalt und ihrer Gültigkeit davon unberührt."}]
[null,null,{"$f":"HLOOKUP(RAUPEX!$AB$1,RAUPEX!$AA$2:$AV$999,43,0)","v":"Nutzungsbedingungen akzeptieren"},{"$nulls":6},{"$f":"RAUPEX!P2","v":"Version 1.0_07/13"}]

{"sheet":"RAUPEX","index":1,"n_rows":50,"n_cols":43,"rows_kept":50,"merged":[[3,3,3,5],[3,12,3,15],[4,2,5,2],[8,8,8,10],[9,8,9,10],[10,8,10,10],[11,8,11,10],[12,8,12,10],[13,8,13,10],[14,8,14,10],[15,8,15,10],[16,8,16,10]]}
[{"$nulls":21},1,{"$f":"AB2","v":"Deutsch"},1,null,null,"Sprache",{"$f":"VLOOKUP(X1,V1:W12,2,FALSE)","v":"Deutsch"}]
[null,null,{"$f":"HLOOKUP($AB$1,$AA$2:$BW$999,2,0)","v":"DRUCKVERLUST RAUPEX ROHRLEITUNGEN - MEDIUM WASSER"},{"$nulls":12},{"$f":"Y13","v":"Version 1.0_07/13"},{"$nulls":5},2,{"$f":"AC2","v":"English"},null,null,1,"Original","Deutsch","English","Italiano","Français","Español",{"$nulls":7},{"$f":"HLOOKUP($AB$1,$AA$2:$BW$999,44,0)","v":"Benutzerdefiniert"},{"$f":"D6","v":0},{"$f":"F6","v":{"v":0,"d":"0.0"}}]
[{"$nulls":21},3,{"$f":"AD2","v":"Italiano"},null,null,2,"DRUCKVERLUST RAUPEX ROHRLEITUNGEN - MEDIUM WASSER","DRUCKVERLUST RAUPEX ROHRLEITUNGEN - MEDIUM WASSER","PRESSURE LOSS CALCULATION RAUPEX  SYSTEM - FLUID WATER","RILEVAMENTO PERDITA DI PRESSIONE DELLA CONDUTTURA - FLUIDO: ACQUA"," RAUPEX PERTE DE CHARGES POUR UN RESEAUX D'EAU FROIDE","RAUPEX CALCULADORA PARA PERDIDA DE PRESIÓN - FLUIDO AGUA",{"$nulls":7},{"$f":"AO3&\" x \"&AP3&\"     \"&AQ3","v":"20 x 2,8     SDR  7,4"},20,2.8,"SDR  7,4"]
[null,null,{"$f":"HLOOKUP($AB$1,$AA$2:$BW$999,3,0)","v":"RAUPEX Rohr"},"63 x 5,8     SDR  11",{"$nulls":4},{"$f":"HLOOKUP($AB$1,$AA$2:$BW$999,18,0)","v":"Rohrleitungsabschnitt:"},{"$nulls":12},4,{"$f":"AE2","v":"Français"},null,null,3,"RAUPEX Rohr","RAUPEX Rohr","RAUPEX Pipe","Tubo RAUPEX","Tube RAUPEX ","Tubo RAUPEX",{"$nulls":7},{"$f":"AO4&\" x \"&AP4&\"     \"&AQ4","v":"25 x 3,5     SDR  7,4"},25,3.5,"SDR  7,4"]
[null,null,{"$f":"IF(AN26=1,AN24,\"\")","v":""},{"$nulls":18},5,{"$f":"AF2","v":"Español"},null,null,4,"Rohraussendurchmesser:","Rohraussendurchmesser:","External pipe diameter","Diametro esterno del tubo:","Dimension extérieure du tube :","Diámetro exterior de tubería:",{"$nulls":7},"32 x 4,4     SDR  7,4",32,4.4,"SDR  7,4"]
[{"$nulls":4},"X",null,"[mm]",{"$nulls":14},6,{"$nulls":3},5,"Wandstärke:","Wandstärke:","Wall thickness","Spessore del tubo:","Epaisseur :","Espesor de pared:",{"$nulls":7},"40 x 5,5     SDR  7,4",40,5.5,"SDR  7,4"]
[{"$nulls":21},7,{"$nulls":3},6,"Volumenstrom:","Volumenstrom:","Flow rate by volume","Portata in volume:","Débit :","Velocidad de flujo por volúmen:",{"$nulls":7},"50 x 6,9     SDR  7,4",50,6.9,"SDR  7,4"]
[null,null,{"$f":"HLOOKUP($AB$1,$AA$2:$BW$999,4,0)","v":"Rohraussendurchmesser:"},"da","=",{"$f":"VLOOKUP(D4,AN2:AQ19,2,FALSE)","v":63},"[mm]",null,{"$f":"HLOOKUP($AB$1,$AA$2:$BW$999,20,0)","v":"Formteile"},null,null,"Symbol",{"$f":"HLOOKUP($AB$1,$AA$2:$BW$999,21,0)","v":"Anzahl"},"","Dp",{"$nulls":10},7,"Rohrlänge:","Rohrlänge:","Pipe length","Lunghezza del tubo:","Longueur du réseau :","Lontigud de tubería:",{"$nulls":7},"63 x 8,6     SDR  7,4",63,8.6,"SDR  7,4"]
[null,null,{"$f":"HLOOKUP($AB$1,$AA$2:$BW$999,5,0)","v":"Wandstärke:"},"s","=",{"$f":"VLOOKUP(D4,AN2:AQ19,3,FALSE)","v":5.8},"[mm]",null,{"$f":"HLOOKUP($AB$1,$AA$2:$BW$999,22,0)","v":"Winkel 90°"},{"$nulls":3},5,1.3,{"$f":"IFERROR(M9*N9*($F$14/2)*$F$13^2,\"-\")","v":{"v":9766.60866650442,"d":"9,767"}},"[Pa]",{"$nulls":9},8,"Wassertemperatur:","Wassertemperatur:","Water temperature","Temperatura Acqua:","Température de l'eau :","Temperatura del agua:",{"$nulls":7},"20 x 1,9     SDR  11",20,1.9,"SDR  11"]
[null,null,{"$f":"HLOOKUP($AB$1,$AA$2:$BW$999,6,0)","v":"Volumenstrom:"},"V","=",3.6,"[l/s]",null,{"$f":"HLOOKUP($AB$1,$AA$2:$BW$999,23,0)","v":"Winkel 45°"},{"$nulls":4},0.5,0,"[Pa]",{"$nulls":9},9,"Geschwindigkeit:","Geschwindigkeit:","Velocity","Velocità:","Vitesse :","Velocidad :",{"$nulls":7},"25 x 2,3     SDR  11",25,2.3,"SDR  11"]
[null,null,{"$f":"HLOOKUP($AB$1,$AA$2:$BW$999,7,0)","v":"Rohrlänge:"},"l","=",100,"[m]",null,{"$f":"HLOOKUP($AB$1,$AA$2:$BW$999,24,0)","v":"T-Stück Abzweig"},{"$nulls":4},1.3,0,"[Pa]",{"$nulls":9},10,"Wasserdichte:","Wasserdichte:","Water density","Densita dell'aqcua:","Densité de l'eau :","Densidad del agua:",{"$nulls":7},"32 x 2,9     SDR  11",32,2.9,"SDR  11"]
[null,null,{"$f":"HLOOKUP($AB$1,$AA$2:$BW$999,8,0)","v":"Wassertemperatur:"},"T","=",20,"[°C]",null,{"$f":"HLOOKUP($AB$1,$AA$2:$BW$999,25,0)","v":"T-Stück Durchgang"},{"$nulls":4},0.3,0,"[Pa]",{"$nulls":8},{"$f":"HLOOKUP($AB$1,$AA$2:$AV$999,33,0)","v":"Nutzungsbedingungen"},11,"Reynoldszahl:","Reynoldszahl:","Reynolds number","Coefficiente Reynolds:","Nombre de Reynolds :","Número Reynolds:",{"$nulls":7},"40 x 3,7     SDR  11",40,3.7,"SDR  11"]
[null,null,{"$f":"HLOOKUP($AB$1,$AA$2:$BW$999,9,0)","v":"Geschwindigkeit:"},"v","=",{"$f":"IFERROR(F10*4000/((F8-2*F9)^2)/PI(),\"-\")","v":{"v":1.7349476756069682,"d":"1.73"}},"[m/s]",null,{"$f":"HLOOKUP($AB$1,$AA$2:$BW$999,26,0)","v":"T-Stück Verteilung"},{"$nulls":4},1.5,0,"[Pa]",{"$nulls":8},"Version 1.0_07/13",12,"Rohrreibungszahl:","Rohrreibungszahl:","Pipe friction coefficient","Coefficiente di attrito del tubo:","Coefficient de rugosité du tube :","Coeficiente de fricción de tubería:",{"$nulls":7},"50 x 4,6     SDR  11",50,4.6,"SDR  11"]
[null,null,{"$f":"HLOOKUP($AB$1,$AA$2:$BW$999,10,0)","v":"Wasserdichte:"},"r","=",{"$f":"IFERROR(Anlage!F6,\"-\")","v":{"v":998.3611272485998,"d":"998.4"}},"[kg/m3]",null,{"$f":"HLOOKUP($AB$1,$AA$2:$BW$999,27,0)","v":"T-Stück Vereinigung"},{"$nulls":4},1.3,0,"[Pa]",{"$nulls":9},13,"kinematische Viskosität:","kinematische Viskosität:","Kinematic viscosity","Viscosità cinematica:","Viscosité cinématique :","Viscosidad cinemática:",{"$nulls":7},"63 x 5,8     SDR  11",63,5.8,"SDR  11"]
[null,null,{"$f":"HLOOKUP($AB$1,$AA$2:$BW$999,11,0)","v":"Reynoldszahl:"},"Re","=",{"$f":"IFERROR(F13*(F8-2*F9)/F17/1000,\"-\")","v":{"v":88294.56723110768,"d":"88295"}},{"$f":"IFERROR(IF((F15*0.007/(F8-2*F9))>=65,\"!\",\"\"),\"-\")","v":""},null,{"$f":"HLOOKUP($AB$1,$AA$2:$BW$999,28,0)","v":"Reduzierung"},{"$nulls":4},0.4,0,"[Pa]",{"$nulls":9},14,"Rohrreibungsgefälle:","Rohrreibungsgefälle:","Head loss","Perdita di carico per attrito:","Coefficient de frottement du tube :","Pérdida de carga:",{"$nulls":7},"75 x 6,8     SDR  11",75,6.8,"SDR  11"]
[null,null,{"$f":"HLOOKUP($AB$1,$AA$2:$BW$999,12,0)","v":"Rohrreibungszahl:"},"l","=",{"$f":"IFERROR(Anlage!D15,\"-\")","v":{"v":0.01912311907641182,"d":"0.01912"}},null,null,{"$f":"HLOOKUP($AB$1,$AA$2:$BW$999,29,0)","v":"Absperrschieber"},{"$nulls":4},0.5,0,"[Pa]",{"$nulls":9},15,"Druckverlust Rohr:","Druckverlust Rohr:","Pressure loss pipe","Perdita di pressione tubo:","Perte de charge Tube :","Pérdida de presión de tubería:",{"$nulls":7},"90 x 8,2     SDR  11",90,8.2,"SDR  11"]
[null,null,{"$f":"HLOOKUP($AB$1,$AA$2:$BW$999,13,0)","v":"kinematische Viskosität:"},"n","=",{"$f":"IFERROR((1.78*10^-6)/(1+0.0337*F12+0.000221*F12^2),\"-\")","v":{"v":1.0099863822060825E-6,"d":"1.01E-06"}},"[m2/s]",null,{"$f":"HLOOKUP($AB$1,$AA$2:$BW$999,30,0)","v":"Kugelhahn"},{"$nulls":4},0.1,0,"[Pa]",{"$nulls":9},16,"Druckverlust Formteil:","Druckverlust Formteil:","Pressure loss fitting","Perdita di pressione pezzi stampati:","Perte de charge :","Pérdida de presión de accesorio:",{"$nulls":7},"110 x 10     SDR  11",110,10,"SDR  11"]
[null,null,{"$f":"HLOOKUP($AB$1,$AA$2:$BW$999,14,0)","v":"Rohrreibungsgefälle:"},"R","=",{"$f":"IFERROR(F16*F14*(F13^2)/(F8-2*F9)/2/10^-3,\"-\")","v":{"v":559.0183193722827,"d":"559"}},"[Pa/m]",null,{"$f":"HLOOKUP($AB$1,$AA$2:$BW$999,31,0)","v":"Druckverlust Formteile gesamt"},{"$nulls":5},{"$f":"IFERROR(SUM(O9:O17),\"-\")","v":{"v":9766.60866650442,"d":"9,767"}},"[Pa]",{"$nulls":9},17,"Druckverlust Rohrleitung:","Druckverlust Rohrleitung:","Pressure loss pipe section","Perdita di pressione conduttura:","Perte de charge du réseau :","Pérdida de presión de sección de tubería:",{"$nulls":7},"125 x 11,4     SDR  11",125,11.4,"SDR  11"]
[{"$nulls":25},18,"Rohrleitungsabschnitt:","Rohrleitungsabschnitt:","Pipe section:","Tratto di tubo:","Tronçon du réseau :","Sección de tubería:",{"$nulls":7},"160 x 14,6     SDR  11",160,14.6,"SDR  11"]
[null,null,{"$f":"HLOOKUP($AB$1,$AA$2:$BW$999,15,0)","v":"Druckverlust Rohr:"},"DpR","=",{"$f":"IFERROR(F18*F11,\"-\")","v":{"v":55901.83193722827,"d":"55,902"}},"[Pa]",{"$nulls":18},19]
[null,null,{"$f":"HLOOKUP($AB$1,$AA$2:$BW$999,16,0)","v":"Druckverlust Formteil:"},"DpF","=",{"$f":"IFERROR(SUM(O9:O17),\"-\")","v":{"v":9766.60866650442,"d":"9,767"}},"[Pa]",{"$nulls":18},20,"Formteile","Formteile","Fitting","Descrizione","Désignation","Accesorio"]
[null,null,{"$f":"HLOOKUP($AB$1,$AA$2:$BW$999,17,0)","v":"Druckverlust Rohrleitung:"},"Dp","=",{"$f":"IFERROR(SUM(F20+F21),\"-\")","v":{"v":65668.44060373268,"d":"65,668"}},"[Pa]",{"$nulls":18},21,"Anzahl","Anzahl","Quantity","Quantità","Quantité","Cantidad"]
[{"$nulls":3},"Dp","=",{"$f":"IFERROR(F22/10^5,\"-\")","v":{"v":0.6566844060373268,"d":"0.657"}},"[bar]",{"$nulls":11},{"$f":"HYPERLINK(CONCATENATE(\"http://\",HLOOKUP($AB$1,$AA$2:$BW$999,32,0)),HLOOKUP($AB$1,$AA$2:$BW$999,32,0))","v":"www.rehau.de/raupex"},{"$nulls":6},22,"Winkel 90°","Winkel 90°","Elbow 90°","Angolo 90°","Coude 90°","Codo 90°"]
[{"$nulls":25},23,"Winkel 45°","Winkel 45°","Elbow 45°","Angolo 45°","Coude 45°","Codo 45°",{"$nulls":7},{"$f":"HLOOKUP($AB$1,$AA$2:$BW$999,34,0)","v":"Bitte Werte benutzerdefiniertes Rohr eintragen:  "}]
[{"$nulls":25},24,"T-Stück Abzweig","T-Stück Abzweig","T-piece - branch flow","Diramazione \"T\"","Té de dérivation","Pieza T - flujo derivado",{"$nulls":7},{"$f":"HLOOKUP($AB$1,$AA$2:$BW$999,35,0)","v":"Bitte benutzerdefinierte Werte löschen:"}]
[{"$nulls":25},25,"T-Stück Durchgang","T-Stück Durchgang","T-piece - through flow","Passaggio \"T\"","Té de passage","Pieza T - flujo de cruce",{"$nulls":6},"Benutzerdefiniert",{"$f":"IF(D4=AN2,1,\"0\")","v":"0"}]
[{"$nulls":25},26,"T-Stück Verteilung","T-Stück Verteilung","T-piece - flow splitting","Distributore \"T\"","Té de distribution","Pieza T - flujo dividido",{"$nulls":6},"Angabe da",{"$f":"IF(D6>0,1,\"0\")","v":"0"}]
[{"$nulls":25},27,"T-Stück Vereinigung","T-Stück Vereinigung","T-piece - flow combining","Congiunzione \"T\"","Té union","Pieza T - flujo combinado",{"$nulls":6},"Angabe di",{"$f":"IF(F6>0,1,\"0\")","v":"0"}]
[{"$nulls":25},28,"Reduzierung","Reduzierung","Reducer","Riduzione","Réduction","Reductor",{"$nulls":6},"Abfrage",{"$f":"SUM(AN27:AN28)","v":0}]
[{"$nulls":25},29,"Absperrschieber","Absperrschieber","Gate valve","Saracinesca","Vanne d'arrêt","Válvula de compuerta"]
[{"$nulls":25},30,"Kugelhahn","Kugelhahn","Ball valve","Rubinetto a sferico","Robinet à boisseau sphérique","Válvula de bola"]
[{"$nulls":25},31,"Druckverlust Formteile gesamt","Druckverlust Formteile gesamt","Total pressure loss of fittings","Perdita complessiva pezzi stampati","Perte de charge totale des raccords","Pérdida de presión total en accesorios"]
[{"$nulls":25},32,"www.rehau.de/raupex","www.rehau.de/raupex","www.rehau.com","www.rehau.com","www.rehau.com","www.rehau.com"]
[{"$nulls":25},33,"Nutzungsbedingungen","Nutzungsbedingungen","Terms & Conditions of use","Condizioni de utilizzo","Conditions d'utilisation","Términos y condiciones de uso"]
[{"$nulls":25},34,"Bitte Werte benutzerdefiniertes Rohr eintragen:  ","Bitte Werte benutzerdefiniertes Rohr eintragen:  ","Please insert values of user-definied pipe:","Inserire i valori per tubazione richiesta:","Entrer les valeurs du tube personnalisé choisi:","Favor de ingresar valores de tubería definidos por el usuario:"]
[{"$nulls":25},35,"Bitte benutzerdefinierte Werte löschen:","Bitte benutzerdefinierte Werte löschen:","Please delete value of user-definied pipe:","Eliminare i valori inseriti:","Supprimer les valeurs personnalisées","Favor de borrar valores de tubería definidos por el usuario:"]
[{"$nulls":25},36,"REHAU SOFTWARE INDUSTRIEROHRSYSTEM RAUPEX","REHAU SOFTWARE INDUSTRIEROHRSYSTEM RAUPEX","REHAU SOFTWARE, INDUSTRIAL PIPING SYSTEM RAUPEX","REHAU SOFTWARE SISTEMA DIE TUBI INDUSTRIALI PREISOLATI RAUPEX","SYSTEME DE TUBES INDUSTRIELS REHAU RAUPEX","SOFTWARE REHAU, SISTEMA INDUSTRIAL DE TUBERÍA RAUPEX"]
[{"$nulls":25},37,"Haftungsausschluss","Haftungsausschluss","Disclaimer ","Disclaimer","Avertissement ","Renuncia"]
[{"$nulls":25},38,"Copyright © 2013","Copyright © 2013","Copyright © 2013","Copyright © 2013","Copyright © 2013","Derechos Reservados 2013"]
[{"$nulls":25},39,"Alle Daten innerhalb dieser Webseite/Software sind urheberrechtlich geschützt und dürfen nicht ohne Zustimmung der Rechteinhaber verwendet werden. Die durch das Urheberrecht begründeten Rechte, insbesondere die der Übersetzung, des Nachdruckes, der Entnahme von Abbildungen, der Funksendungen, der Wiedergabe auf fotomechanischem oder ähnlichem Wege und der Speicherung in Datenverarbeitungsanlagen, bleiben vorbehalten.","Alle Daten innerhalb dieser Webseite/Software sind urheberrechtlich geschützt und dürfen nicht ohne Zustimmung der Rechteinhaber verwendet werden. Die durch das Urheberrecht begründeten Rechte, insbesondere die der Übersetzung, des Nachdruckes, der Entnahme von Abbildungen, der Funksendungen, der Wiedergabe auf fotomechanischem oder ähnlichem Wege und der Speicherung in Datenverarbeitungsanlagen, bleiben vorbehalten.","All data contained within this website/software is copyright protected and may not be used without the permission of the copyright holder. The rights afforded by the copyright, particularly those concerning translation, reprinting, extracting images, broadcasting, duplicating by photomechanical or similar means and storing in data processing systems, are reserved. ","Contact: info@rehau.com  ","Toutes les données dans ce site web / logiciels sont protégées par copyright et ne peuvent être utilisées sans l'autorisation du détenteur du copyright. Les droits d'auteur protègent la traduction, la réimpression, la réutilisation d'illustrations, de la radiodiffusion, la reproduction par des moyens photographiques ou similaires ainsi que le stockage dans des systèmes de traitement des données.","Todos los datos que aparecen en este sitio web / software están protegidos por Derechos Reservados y no pueden ser utilizados sin el consentimiento del titular del derecho de autor. Los derechos reconocidos por el derecho de autor, en particular las relacionadas a traducción, re impresión, extracción de imágenes, radiodifusión, duplicación en medios foto mecánicos o similar y el almacenamiento en sistemas de procesamiento de datos, son reservados."]
{"$rows_left_out":11}
{"sheet":"Anlage","index":2,"n_rows":29,"n_cols":14,"rows_kept":29,"hidden":true}
["Dichteberechnung Wasser"]
[]
["si =",{"$f":"F4/221.287","v":0.004519018288467013},null,null,"T",{"$f":"RAUPEX!F12","v":20}]
["ta =",{"$f":"(F3+273.15)/647.3","v":0.4528811988258922},null,null,"p",1]
["gu =",{"$f":"370000000-312219900*(B4^2)-199985*(B4^-6)","v":282784428.864606}]
["gw =",{"$f":"B5+((1.72*(B5^2)+13629260000000000*(B3-1.500705*B4))^0.5)","v":641032782.6842351},null,null,"Dichte",{"$f":"1/B7","v":{"v":998.3611272485998,"d":"998.4 kg/m3"}}]
["kv =",{"$f":"0.417/(B6^(1/3.4))-0.0001139706+0.00009949927*B4+((0.6537154-B4)^2)*(0.00007241165+((0.6537154-B4)^8)*0.7676621)-0.00000000001052358*(62.5+13.10268*B3+(B3^2))/(0.000015108+(B4^11))","v":{"v":0.001001641563064376,"d":"0.00100164"}}]
[]
[]
[]
[null,null,"lamb0","lamb1","lamb2","lamb3","lamb4","lamb5","lamb6","lamb7","lamb8","lamb9","lamb10","Fehler"]
["k=",{"v":0.007,"d":"0.007 "},{"v":0.1,"d":"0.1 "},{"$f":"(-2*LOG((($B$12/$B$13)/3.71)+(2.51/($B$14*(C12)^0.5))))^(-2)","v":{"v":0.01645720064028543,"d":"0.016457 "}},{"$f":"(-2*LOG((($B$12/$B$13)/3.71)+(2.51/($B$14*(D12)^0.5))))^(-2)","v":{"v":0.01942078864353125,"d":"0.019421 "}},{"v":0.019093068780293546,"d":"0.019093 "},{"v":0.01912618461810799,"d":"0.019126 "},{"v":0.019122806677721562,"d":"0.019123 "},{"v":0.01912315091115952,"d":"0.019123 "},{"v":0.01912311582818168,"d":"0.019123 "},{"v":0.01912311940367138,"d":"0.019123 "},{"v":0.019123119039274158,"d":"0.019123 "},{"v":0.01912311907641182,"d":"0.019123 "},{"$f":"(M12-L12)*100/M12","v":{"v":1.9420294803165622E-7,"d":"0.0000002 "}}]
["di=",{"$f":"RAUPEX!F8-(2*RAUPEX!F9)","v":51.4}]
["Re=",{"$f":"RAUPEX!F15","v":{"v":88294.56723110768,"d":"88295"}},"Fehler",{"$f":"N12","v":{"v":1.9420294803165622E-7,"d":"0.0000002 "}}]
[null,null,"l=",{"$f":"M12","v":{"v":0.01912311907641182,"d":"0.01912"}}]
[]
[]
[null,"SDR",11,"SDR",7.4,"Zähler"]
[{"$nulls":3},{"v":16,"d":"16.0"},2.2,{"v":1,"d":"1.0"}]
[null,{"v":20,"d":"20.0"},1.9,{"v":20,"d":"20.0"},2.8]
[null,{"v":25,"d":"25.0"},2.3,{"v":25,"d":"25.0"},3.5]
[null,{"v":32,"d":"32.0"},2.9,{"v":32,"d":"32.0"},4.4]
[null,{"v":40,"d":"40.0"},3.7,{"v":40,"d":"40.0"},5.5]
[null,{"v":50,"d":"50.0"},4.6,{"v":50,"d":"50.0"},6.9]
[null,{"v":63,"d":"63.0"},5.8,{"v":63,"d":"63.0"},8.7]
[null,{"v":75,"d":"75.0"},6.8]
[null,{"v":90,"d":"90.0"},8.2]
[null,{"v":110,"d":"110.0"},{"v":10,"d":"10.0"}]
[null,{"v":160,"d":"160.0"},14.6]