{"text_format":"3","workbook":"xlsx","n_sheets":4,"sheets":["Nutzungsbedingungen","Vorspannung","Sprachen","Quellen"],"not_rendered":{"charts":4,"images":7,"defined_names":8},"read":"whole","date_system":"1900"}

{"sheet":"Nutzungsbedingungen","index":0,"n_rows":35,"n_cols":13,"rows_kept":35,"merged":[[1,1,1,9],[2,1,3,8],[4,1,17,11],[18,1,20,6],[21,1,35,6],[30,8,30,10],[34,8,35,11]]}
[]
[null,{"$f":"HLOOKUP(Sprachen!$G$1,Sprachen!$F$2:$O$50,40,0)","v":"NUTZUNGSBEDINGUNGEN"}]
[null,{"$f":"HLOOKUP(Sprachen!$G$1,Sprachen!$F$2:$O$50,36,0)","v":"Berechnungstool RAUPEX Industrierohrsystem: Montage mit Vorspannung oder Selbstspannung"}]
[]
[null,{"$f":"HLOOKUP(Sprachen!$G$1,Sprachen!$F$2:$O$50,37,0)","v":"Mit diesem RAUPEX Berechnungstool können verschiedene Kräfte bei der Montage mit Vorspannung ermittelt werden. Das RAUPEX-System muss hierbei aus den Komponenten RAUPEX oder RAUTHERM FW Rohren der Rohrreihen SDR 11 oder SDR 7,4 und den Verbindungstechniken SCHIEBEHÜLSE, SMARTFUSE oder FUSAPEX bestehen. In den vorgespannten Rohrleitungsteilen dürfen hierbei keine Flanschverbindungen, keine bauseitigen Verbindungstechniken oder zugempfindliche Bauteile enthalten sein. Nach Eingabe aller Daten in den grau hinterlegten Zellen werden erwartende Kräfte im Betrieb unter Druck, außer Betrieb drucklos sowie zur Vorspannung ermittelt. Die im Berechnungstool ermittelten Kräfte sind hierbei nicht mit Sicherheitsfaktoren beaufschlagt. Die größte ermittelte Kraft ist relevant für die Auslegung der Festpunkte. Auch wird eine Zuglänge zur Vorspannung ermittelt, welche vorzugsweise in der Mitte der Rohrleitung zu platzieren ist. Die Kraftübertragung am Festpunkt oder beim Vorspannen der Rohrleitung muss immer über die stirnseitige, über das Rohr herausstehende, Kreisringfläche der Verbindungstechnik erfolgen. Ergänzende Informationen zur Montage mit Vorspannung sind dem Installationsvideo zu entnehmen, welche durch einen Klick auf nebenstehendes Bild gestartet werden kann. \n\nBauseitige Komponenten und Gebäudeanforderungen außerhalb des RAUPEX-Systems sind in der Betrachtung nicht einbezogen und müssen durch den Errichter und Betreiber gesondert definiert und umgesetzt werden. Das Berechnungstool bietet unterschiedliche Eingabemöglichkeiten an, welche durch den Benutzer auszuwählen, zu kombinieren und auf den jeweiligen Anwendungsfall zu übertragen sind. Die bei der Berechnung hinterlegten Formeln, Konstanten, Variablen und Näherungswerte können nicht immer auf die jeweiligen Betriebsparameter angepasst werden. Der sich hierbei ergebende Fehler fließt direkt in die Ergebnisse ein. Auch können sich durch Fehler in der Berechnung weitere Abweichungen ergeben."}]
{"$rows_empty":13}
[null,{"$f":"HLOOKUP(Sprachen!$G$1,Sprachen!$F$2:$O$50,38,0)","v":"Das Ergebnis ist damit ausschließlich eine ungefähre Näherung, für deren praktische Genauigkeit und Anwendbarkeit wir im Einzelfall keine Gewähr übernehmen können."},{"$nulls":6},{"$f":"HLOOKUP(Sprachen!$G$1,Sprachen!$F$2:$O$50,42,0)","v":"Installationsvideo"}]
[]
[]
[null,{"$f":"HLOOKUP(Sprachen!$G$1,Sprachen!$F$2:$O$50,39,0)","v":"Wir sind stehts bemüht dieses Berechnungstool zu verbessern und bitten in diesem Zusammenhang um Ihre Rückmeldung aus der praktischen Anwendung sowie der Übereinstimmung mit Anlagen im Betrieb. Aktualisierte Versionen werden über unsere Homepage als Download zur Verfügung gestellt, somit prüfen Sie bitte bei Nutzung die Aktualität des Berechnungstool.\n\nAlle Daten innerhalb dieser Webseite/Software sind urheberrechtlich geschützt und dürfen nicht ohne Zustimmung der Rechteinhaber verwendet werden. Die durch das Urheberrecht begründeten Rechte, insbesondere die der Übersetzung, des Nachdruckes, der Entnahme von Abbildungen, der Funksendungen, der Wiedergabe auf fotomechanischem oder ähnlichem Wege und der Speicherung in Datenverarbeitungsanlagen, bleibt vorbehalten.\n\nDurch die Nutzung dieses Berechnungstools gelten die Liefer- und Zahlungsbedingungen der REHAU Industries SE & Co. KG als akzeptiert. Diese stehen auf unserer Homepage zur Verfügung oder unter folgendem Link: \nwww.rehau.com/de-de/liefer-und-zahlungsbedingungen\n\nWenn Sie Fragen haben, kontaktieren Sie uns bitte: \nREHAU Industries SE & Co. KG, Ytterbium 4, D-91058 Erlangen\nTel. +49-9131-92-0, Team Industrierohrsysteme"}]
{"$rows_empty":7}
[{"$nulls":12},"V-09.25"]
[{"$nulls":8},{"$f":"HLOOKUP(Sprachen!$G$1,Sprachen!$F$2:$O$50,43,0)","v":"Sprache wählen"}]
[]
[]
[]
[{"$nulls":8},{"$f":"HLOOKUP(Sprachen!$G$1,Sprachen!$F$2:$O$50,35,0)","v":"Nutzungsbedingungen\nakzeptieren"}]

{"sheet":"Vorspannung","index":1,"n_rows":72,"n_cols":20,"rows_kept":72,"merged":[[4,3,4,5],[4,10,7,13],[5,3,6,5],[8,12,8,13],[28,9,28,10],[29,5,29,7],[53,15,57,15],[58,15,62,15],[67,6,67,8]]}
[]
[null,{"$f":"HLOOKUP(Sprachen!$G$1,Sprachen!$F$2:$O$50,2,0)","v":"RAUPEX Industrierohrsystem"}]
[null,{"$f":"HLOOKUP(Sprachen!$G$1,Sprachen!$F$2:$O$50,3,0)","v":"Montage mit Vorspannung"}]
[null,null,{"$f":"IF(Sprachen!D16<0,Sprachen!C16,\"\")","v":""}]
[null,{"$f":"HLOOKUP(Sprachen!$G$1,Sprachen!$F$2:$O$50,4,0)","v":"RAUPEX Rohr"},null,"63 x 5,8     SDR  11",{"$nulls":6},{"$f":"HLOOKUP(Sprachen!$G$1,Sprachen!$F$2:$O$50,41,0)","v":"Bitte klicken Sie hier und beachten die Hinweise in den Nutzungsbedingungen."}]
[null,{"$f":"HLOOKUP(Sprachen!$G$1,Sprachen!$F$2:$O$50,34,0)","v":"Kommentar"},{"$nulls":4},"  [mm]"]
[]
[]
[null,{"$f":"HLOOKUP(Sprachen!$G$1,Sprachen!$F$2:$O$50,5,0)","v":"Rohraußendurchmesser"},"da",null,{"$f":"VLOOKUP(D5,Sprachen!P3:S19,2,FALSE)","v":63},"[mm]",{"$nulls":6},{"$f":"TODAY()","v":"2025-11-24"}]
[null,{"$f":"HLOOKUP(Sprachen!$G$1,Sprachen!$F$2:$O$50,6,0)","v":"Rohrwandstärke"},"s",null,{"$f":"VLOOKUP(D5,Sprachen!P3:S19,3,FALSE)","v":5.8},"[mm]",null,{"$f":"HLOOKUP(Sprachen!$G$1,Sprachen!$F$2:$O$50,21,0)","v":"Ergebnisse"}]
[null,{"$f":"HLOOKUP(Sprachen!$G$1,Sprachen!$F$2:$O$50,7,0)","v":"Ausdehnungskoeffizient"},"a",null,0.15,"[mm/mK]"]
[]
[null,{"$f":"HLOOKUP(Sprachen!$G$1,Sprachen!$F$2:$O$50,8,0)","v":"Betriebsdruck"},"pB",null,3,"[bar]",null,{"$f":"HLOOKUP(Sprachen!$G$1,Sprachen!$F$2:$O$50,22,0)","v":"Längenermittlung"}]
[{"$nulls":7},{"$f":"HLOOKUP(Sprachen!$G$1,Sprachen!$F$2:$O$50,23,0)","v":"Gesamtzuglänge"},null,null,"ΔL",{"$f":"P59","v":{"v":295.93615358686947,"d":"296"}},"[mm]"]
[null,{"$f":"HLOOKUP(Sprachen!$G$1,Sprachen!$F$2:$O$50,9,0)","v":"Temperatur bei Montage"},"Tz",null,20,"[°C]"]
[]
[null,{"$f":"HLOOKUP(Sprachen!$G$1,Sprachen!$F$2:$O$50,10,0)","v":"Temperatur im Betrieb maximal"},"TB max",null,35,"[°C]",null,{"$f":"HLOOKUP(Sprachen!$G$1,Sprachen!$F$2:$O$50,24,0)","v":"Montagetemperatur"},null,null,"Tz"]
[null,{"$f":"HLOOKUP(Sprachen!$G$1,Sprachen!$F$2:$O$50,11,0)","v":"Temperatur im Betrieb minimal"},"TB min",null,30,"[°C]",null,{"$f":"HLOOKUP(Sprachen!$G$1,Sprachen!$F$2:$O$50,25,0)","v":"Zugkraft"},null,null,"Fz",{"$f":"T56","v":{"v":1876.015292360326,"d":"1,876"}},"[N]"]
[]
[null,{"$f":"HLOOKUP(Sprachen!$G$1,Sprachen!$F$2:$O$50,12,0)","v":"Temperatur außer Betrieb, drucklos maximal"},"TaB max",null,10,"[°C]"]
[null,{"$f":"HLOOKUP(Sprachen!$G$1,Sprachen!$F$2:$O$50,13,0)","v":"Temperatur außer Betrieb, drucklos minimal"},"TaB min",null,5,"[°C]",null,{"$f":"HLOOKUP(Sprachen!$G$1,Sprachen!$F$2:$O$50,26,0)","v":"Im Betrieb unter Druck"},{"$nulls":3},"TBmax","I","TBmin"]
[{"$nulls":7},{"$f":"HLOOKUP(Sprachen!$G$1,Sprachen!$F$2:$O$50,27,0)","v":"Kraft im Festpunkt"},null,null,"FB",{"$f":"T59","v":0},"[N]",{"$f":"T60","v":{"v":414.63991656737534,"d":"415"}}]
[null,{"$f":"HLOOKUP(Sprachen!$G$1,Sprachen!$F$2:$O$50,14,0)","v":"Abstand der Festpunktschellen außen"},"La",null,100,"[m]"]
[null,{"$f":"HLOOKUP(Sprachen!$G$1,Sprachen!$F$2:$O$50,15,0)","v":"Abstand Fitting zu Fixpunkt links"},"Lfixl",null,10,"[mm]"]
[null,{"$f":"HLOOKUP(Sprachen!$G$1,Sprachen!$F$2:$O$50,16,0)","v":"Abstand Fitting zu Fixpunkt rechts"},"Lfixr",null,15,"[mm]",null,{"$f":"HLOOKUP(Sprachen!$G$1,Sprachen!$F$2:$O$50,28,0)","v":"Außer Betrieb drucklos"},{"$nulls":3},"TaBmax","I","TaBmin"]
[{"$nulls":7},{"$f":"HLOOKUP(Sprachen!$G$1,Sprachen!$F$2:$O$50,29,0)","v":"Kraft im Festpunkt"},null,null,"FaB",{"$f":"T62","v":{"v":3870.2973654976377,"d":"3,870"}},"[N]",{"$f":"T63","v":{"v":5122.847467142709,"d":"5,123"}}]
[]
[]
[null,{"$f":"E24","v":{"v":10,"d":"10 mm"}},null,{"$f":"E23","v":{"v":100,"d":"100.0 m"}},{"$nulls":5},{"$f":"E25","v":{"v":15,"d":"15 mm"}}]
[null,"Lfixl",null,"La",{"$nulls":5},"Lfixr",{"$nulls":3},{"$f":"IF(P54=\"Vorspannung\",HLOOKUP(Sprachen!$G$1,Sprachen!$F$2:$O$50,30,0),HLOOKUP(Sprachen!$G$1,Sprachen!$F$2:$O$50,31,0))","v":"Vorspannung"}]
{"$rows_left_out":26}
{"sheet":"Sprachen","index":2,"n_rows":44,"n_cols":19,"rows_kept":44,"hidden":true}
[1,{"$f":"G2","v":"Deutsch"},1,null,null,"Sprache",{"$f":"VLOOKUP(C1,A1:B14,2,FALSE)","v":"Deutsch"}]
[2,{"$f":"H2","v":"English"},null,null,1,"Original","Deutsch","English","Italiano","Español","Polski","中文"]
[3,"Italiano",null,null,2,null,"RAUPEX Industrierohrsystem","RAUPEX Industrial Piping System",null,null,"System instalacji przemysłowych RAUPEX","RAUPEX工业管道系统",{"$nulls":3},{"$f":"Q3&\" x \"&R3&\"     \"&S3","v":"20 x 1,9     SDR  11"},20,1.9,"SDR  11"]
[4,"Español",null,null,3,null,"Montage mit Vorspannung","Prestressed installation",null,null,"Mongaż z naciągiem wstępnym","预应力安装",{"$nulls":3},"25 x 2,3     SDR  11",25,2.3,"SDR  11"]
[5,"Polski",null,null,4,null,"RAUPEX Rohr","RAUPEX pipe",null,null,"Rura RAUPEX","RAUPEX管道",{"$nulls":3},"32 x 2,9     SDR  11",32,2.9,"SDR  11"]
[6,"中文",null,null,5,null,"Rohraußendurchmesser","Outer pipe diameter",null,null,"Średnica zewnętrzna rury","管道外径",{"$nulls":3},"40 x 3,7     SDR  11",40,3.7,"SDR  11"]
[7,{"$nulls":3},6,null,"Rohrwandstärke","Pipe wall thickness",null,null,"Grubość ścianki rury","管道壁厚",{"$nulls":3},"50 x 4,6     SDR  11",50,4.6,"SDR  11"]
[8,{"$nulls":3},7,null,"Ausdehnungskoeffizient","Coefficient of expansion",null,null,"Współczynnik rozszerzalności","膨胀系数",{"$nulls":3},"63 x 5,8     SDR  11",63,5.8,"SDR  11"]
[9,{"$nulls":3},8,null,"Betriebsdruck","Operating pressure",null,null,"Ciśnienie robocze","工作压力",{"$nulls":3},"75 x 6,8     SDR  11",75,6.8,"SDR  11"]
[{"$nulls":4},9,null,"Temperatur bei Montage","Installation temperature",null,null,"Temperatura montażu","安装时温度",{"$nulls":3},"90 x 8,2     SDR  11",90,8.2,"SDR  11"]
[{"$nulls":4},10,null,"Temperatur im Betrieb maximal","Temperature max. during operation",null,null,"Temperatura robocza maks.","工作时最高温度",{"$nulls":3},"110 x 10     SDR  11",110,{"v":10,"d":"10.0"},"SDR  11"]
[null,{"$f":"HLOOKUP($G$1,$F$2:$O$50,2,0)","v":"RAUPEX Industrierohrsystem"},null,null,11,null,"Temperatur im Betrieb minimal","Temperature min. during operation",null,null,"Temperatura robocza min.","工作时最低温度",{"$nulls":3},"125 x 11,4     SDR  11",125,11.4,"SDR  11"]
[{"$nulls":4},12,null,"Temperatur außer Betrieb, drucklos maximal","Temperature max. offline, pressureless",null,null,"Temperatura offline, bez ciśnienia maks.","非工作、无压状态时最高温度",{"$nulls":3},"160 x 14,6     SDR  11",160,14.6,"SDR  11"]
[{"$nulls":4},13,null,"Temperatur außer Betrieb, drucklos minimal","Temperature min. offline, pressureless",null,null,"Temperatura offline, bez ciśnienia min.","非工作、无压状态时最低温度",{"$nulls":3},"20 x 2,8     SDR  7,4",20,2.8,"SDR  7,4"]
[{"$nulls":4},14,null,"Abstand der Festpunktschellen außen","Distance of the fixed point clamps outside",null,null,"Odległość punktów stałych","管道外部锚点间的距离",{"$nulls":3},"25 x 3,5     SDR  7,4",25,3.5,"SDR  7,4"]
[{"$nulls":4},15,null,"Abstand Fitting zu Fixpunkt links","Distance fitting to fixed point left",null,null,"Odległość punktu stałego po lewej stronie","左侧锚固管件到左锚点的间隙",{"$nulls":3},"32 x 4,4     SDR  7,4",32,4.4,"SDR  7,4"]
[{"$nulls":4},16,null,"Abstand Fitting zu Fixpunkt rechts","Distance fitting to fixed point right",null,null,"Odległość punktu stałego po prawej stronie","右侧锚固管件到右锚点的间隙",{"$nulls":3},"40 x 5,5     SDR  7,4",40,5.5,"SDR  7,4"]
[{"$nulls":4},17,null,"Optimierung möglich aber Problem Offline","…",{"$nulls":7},"50 x 6,9     SDR  7,4",50,6.9,"SDR  7,4"]
[{"$nulls":4},18,null,"letzte Verbindung","Last connection",null,null,"Ostatnie połączenie","最后一个连接",{"$nulls":3},"63 x 8,6     SDR  7,4",63,8.6,"SDR  7,4"]
[{"$nulls":4},19,null,"Zugpunkt","Pulling point",null,null,"Punkt ciągnięcia","拉拽点"]
[{"$nulls":4},20,null,"Rohr ziehen","Pull the pipe",null,null,"Ciągnij rurę","拉伸管道"]
[{"$nulls":4},21,null,"Ergebnisse","Results",null,null,"Wyniki","计算结果"]
[{"$nulls":4},22,null,"Längenermittlung","Length determination",null,null,"Określenie długości","距离计算"]
[{"$nulls":4},23,null,"Gesamtzuglänge","Total tensile length",null,null,"Całkowita dł. rozciągania","总拉伸距离"]
[{"$nulls":4},24,null,"Montagetemperatur","Installation temperature",null,null,"Temperatura montażu","安装温度时"]
[{"$nulls":4},25,null,"Zugkraft","Tensile force",null,null,"Siła rozciągająca","拉力"]
[{"$nulls":4},26,null,"Im Betrieb unter Druck","In operation under pressure",null,null,"Podczas pracy pod ciśnieniem","带压工作时"]
[{"$nulls":4},27,null,"Kraft im Festpunkt","Force at fixed point",null,null,"Siła w punkcie mocowania","锚点拉力"]
[{"$nulls":4},28,null,"Außer Betrieb drucklos","Out of operation pressureless",null,null,"Poza pracą bez ciśnienia","非工作、无压状态时"]
[{"$nulls":4},29,null,"Kraft im Festpunkt","Force at fixed point",null,null,"Siła w punkcie mocowania","锚点拉力"]
{"$rows_left_out":15}
{"sheet":"Quellen","index":3,"n_rows":138,"n_cols":17,"rows_kept":138,"hidden":true}
["Temperatur","E-Modul (Zug)"]
["[° C]","[N/mm2]","d"]
[-40,1884,{"$nulls":12},"Querschnittsfläche PEX-Rohr",{"$f":"IFERROR((((Vorspannung!E9/2)^2)*PI())-((((Vorspannung!E9-Vorspannung!E10-Vorspannung!E10)/2)^2)*PI()),\"-\")","v":{"v":1042.2547787549493,"d":"1,042"}},"[mm2]"]
[-39,{"$f":"B3+Quellen!$C$4","v":{"v":1870.35,"d":"1870"}},{"$f":"(Quellen!B3-Quellen!B23)/(Quellen!A3-Quellen!A23)","v":{"v":-13.65,"d":"-13.7"}},{"$nulls":11},"Gewicht PEX-Rohr pro Meter",{"$f":"IFERROR(P3*1000*1/10^6,\"-\")","v":{"v":1.0422547787549492,"d":"1.0"}},"[kg/m]"]
[-38,{"$f":"B4+Quellen!$C$4","v":{"v":1856.6999999999998,"d":"1857"}},{"$nulls":12},"Innenvolumen PEX-Rohr",{"$f":"(Vorspannung!E9-Vorspannung!E10-Vorspannung!E10)^2*PI()/4/1000","v":{"v":2.0749905317695228,"d":"2.1"}},"[ltr/m]"]
[-37,{"$f":"B5+Quellen!$C$4","v":{"v":1843.0499999999997,"d":"1843"}},{"$nulls":12},"Poisson-/Querkontraktionszahl Thermoplaste",0.35]
[-36,{"$f":"B6+Quellen!$C$4","v":{"v":1829.3999999999996,"d":"1829"}},{"$nulls":12},"Sicherheitsfaktor für Kraft",1]
[-35,{"$f":"B7+Quellen!$C$4","v":{"v":1815.7499999999995,"d":"1816"}}]
[-34,{"$f":"B8+Quellen!$C$4","v":{"v":1802.0999999999995,"d":"1802"}}]
[-33,{"$f":"B9+Quellen!$C$4","v":{"v":1788.4499999999994,"d":"1788"}}]
[-32,{"$f":"B10+Quellen!$C$4","v":{"v":1774.7999999999993,"d":"1775"}}]
[-31,{"$f":"B11+Quellen!$C$4","v":{"v":1761.1499999999992,"d":"1761"}}]
[-30,{"$f":"B12+Quellen!$C$4","v":{"v":1747.499999999999,"d":"1748"}}]
[-29,{"$f":"B13+Quellen!$C$4","v":{"v":1733.849999999999,"d":"1734"}}]
[-28,{"$f":"B14+Quellen!$C$4","v":{"v":1720.199999999999,"d":"1720"}}]
[-27,{"$f":"B15+Quellen!$C$4","v":{"v":1706.5499999999988,"d":"1707"}}]
[-26,{"$f":"B16+Quellen!$C$4","v":{"v":1692.8999999999987,"d":"1693"}}]
[-25,{"$f":"B17+Quellen!$C$4","v":{"v":1679.2499999999986,"d":"1679"}}]
[-24,{"$f":"B18+Quellen!$C$4","v":{"v":1665.5999999999985,"d":"1666"}}]
[-23,{"$f":"B19+Quellen!$C$4","v":{"v":1651.9499999999985,"d":"1652"}}]
[-22,{"$f":"B20+Quellen!$C$4","v":{"v":1638.2999999999984,"d":"1638"}}]
[-21,{"$f":"B21+Quellen!$C$4","v":{"v":1624.6499999999983,"d":"1625"}}]
[-20,1611]
[-19,{"$f":"B23+Quellen!$C$24","v":{"v":1585.45,"d":"1585"}},{"$f":"(Quellen!B23-Quellen!B43)/(Quellen!A23-Quellen!A43)","v":{"v":-25.55,"d":"-25.6"}}]
[-18,{"$f":"B24+Quellen!$C$24","v":{"v":1559.9,"d":"1560"}}]
[-17,{"$f":"B25+Quellen!$C$24","v":{"v":1534.3500000000001,"d":"1534"}}]
[-16,{"$f":"B26+Quellen!$C$24","v":{"v":1508.8000000000002,"d":"1509"}}]
[-15,{"$f":"B27+Quellen!$C$24","v":{"v":1483.2500000000002,"d":"1483"}}]
[-14,{"$f":"B28+Quellen!$C$24","v":{"v":1457.7000000000003,"d":"1458"}}]
[-13,{"$f":"B29+Quellen!$C$24","v":{"v":1432.1500000000003,"d":"1432"}}]
{"$rows_left_out":108}