{"text_format":"3","workbook":"xlsx","n_sheets":3,"sheets":["Nutzungsbedingungen","RAUFRIGO","Berechnung"],"not_rendered":{"images":9,"defined_names":7},"read":"whole","date_system":"1900"}

{"sheet":"Nutzungsbedingungen","index":0,"n_rows":11,"n_cols":22,"rows_kept":11,"merged":[[3,1,3,9],[4,1,4,9],[5,1,5,9],[6,1,6,9],[7,1,7,9],[8,1,8,9],[9,1,9,9]]}
[{"$nulls":21},{"$f":"HLOOKUP(RAUFRIGO!$AC$1,RAUFRIGO!$AB$2:$AZ$999,43,0)","v":"Nutzungsbedingungen"}]
[]
[]
[null,{"$f":"HLOOKUP(RAUFRIGO!$AC$1,RAUFRIGO!$AB$2:$AZ$999,44,0)","v":"REHAU SOFTWARE INDUSTRIEROHRSYSTEM RAUFRIGO"}]
[null,{"$f":"HLOOKUP(RAUFRIGO!$AC$1,RAUFRIGO!$AB$2:$AZ$999,45,0)","v":"Haftungsausschluss"}]
[null,{"$f":"HLOOKUP(RAUFRIGO!$AC$1,RAUFRIGO!$AB$2:$AZ$999,46,0)","v":"Copyright © 2013"}]
[null,{"$f":"HLOOKUP(RAUFRIGO!$AC$1,RAUFRIGO!$AB$2:$AZ$999,47,0)","v":"Alle Daten innerhalb dieser Webseite/Software sind urheberrechtlich geschützt und dürfen nicht ohne Zustimmung der Rechteinhaber verwendet werden. Die durch das Urheberrecht begründeten Rechte, insbesondere die der Übersetzung, des Nachdruckes, der Entnahme von Abbildungen, der Funksendungen, der Wiedergabe auf fotomechanischem oder ähnlichem Wege und der Speicherung in Datenverarbeitungsanlagen, bleiben vorbehalten."}]
[null,{"$f":"HLOOKUP(RAUFRIGO!$AC$1,RAUFRIGO!$AB$2:$AZ$999,48,0)","v":"Kontakt: info@rehau.com "}]
[null,{"$f":"HLOOKUP(RAUFRIGO!$AC$1,RAUFRIGO!$AB$2:$AZ$999,49,0)","v":"Datenschutz: Alle innerhalb dieser Webseite vom Anwender eingegebenen und verarbeiteten Daten werden vertraulich gem. § 5 BDSG behandelt und nicht an Dritte weitergegeben. Die Daten werden nur zur Bearbeitung der Anfragen benutzt. "}]
[null,{"$f":"HLOOKUP(RAUFRIGO!$AC$1,RAUFRIGO!$AB$2:$AZ$999,50,0)","v":"Die Webseite/Software wird von den Herausgebern kostenlos zur Verfügung gestellt. Die Herausgeber übernehmen keinerlei Gewähr für die Aktualität, Korrektheit, zu Grunde gelegte Berechnungsformeln, Berechnungsergebnisse, Vollständigkeit oder Qualität der bereitgestellten Informationen. Haftungsansprüche gegen die Herausgeber und Autoren, die sich auf Schäden materieller oder ideeler Art beziehen, welche durch die Nutzung der dargebotenen Informationen bzw. durch Nutzung fehlerhafter oder unvollständiger Informationen verursacht wurden, sind grundsätzlich ausgeschlossen, sofern seitens der Herausgeber und Autoren kein nachweislich vorsätzliches oder grob fahrlässiges Verschulden vorliegt. Die Herausgeber behalten es sich ausdrücklich vor, Teile der Seiten oder den gesamten Inhalt ohne gesonderte Ankündigung zu verändern, zu ergänzen oder die Veröffentlichung zeitweise oder endgültig einzustellen. Aus der Veröffentlichung kann nicht entnommen werden, dass die verwendeten Bezeichnungen frei von Rechten Dritter sind. Sofern auf Verweisziele („Links“) direkt oder indirekt verwiesen wird, die außerhalb des Verantwortungsbereichs des Herausgebers/Autoren liegen, haften diese allenfalls dann, wenn sie von den Inhalten Kenntnis hatten, und es ihnen technisch möglich und zumutbar wäre, die Nutzung im Falle rechtswidriger Inhalte zu verhindern. Für darüber hinausgehende Inhalte und insbesondere für Schäden, die aus der Nutzung oder Nichtnutzung solcherart dargebotener Informationen entstehen, haftet allein der Anbieter dieser Seiten, nicht derjenige, der über Links auf die jeweilige Veröffentlichung lediglich verweist. Dieser Haftungsausschluss ist als Teil des Internetangebots dieser Seite / dieses Softwareangebots zu betrachten. Sofern Teile oder einzelne Formulierungen dieses Textes der geltenden Rechtslage nicht, nicht mehr oder nicht vollständig entsprechen sollten, bleiben die übrigen Teile des Dokuments in ihrem Inhalt und ihrer Gültigkeit davon unberührt."}]
[null,null,{"$f":"HLOOKUP(RAUFRIGO!$AC$1,RAUFRIGO!$AB$2:$AZ$999,51,0)","v":"Nutzungsbedingungen akzeptieren"},{"$nulls":12},{"$f":"RAUFRIGO!N4","v":0}]

{"sheet":"RAUFRIGO","index":1,"n_rows":57,"n_cols":44,"rows_kept":57,"merged":[[3,8,3,10],[20,20,20,24],[21,21,21,24],[22,21,22,24],[23,21,23,24],[24,21,24,24],[25,21,25,24],[26,21,26,24],[27,21,27,24],[28,21,28,24]]}
[{"$nulls":22},1,{"$f":"AC2","v":"Deutsch"},1,null,null,"Sprache",{"$f":"VLOOKUP(Y1,W1:X10,2,FALSE)","v":"Deutsch"}]
[null,null,{"$f":"HLOOKUP($AC$1,$AB$2:$CA$999,2,0)","v":"RAUFRIGO ENERGIEVERLUSTBERECHNUNG"},{"$nulls":19},2,{"$f":"AD2","v":"English"},null,null,1,"Original","Deutsch","English","Italiano","Français","Español","Türkçe","Русский","Polski","汉语"]
[{"$nulls":8},{"$f":"HLOOKUP($AC$1,$AB$2:$CA$999,3,0)","v":"Rohrleitungsabschnitt: "},{"$nulls":13},3,{"$f":"AE2","v":"Italiano"},null,null,2,"RAUFRIGO ENERGIEVERLUSTBERECHNUNG","RAUFRIGO ENERGIEVERLUSTBERECHNUNG","RAUFRIGO ENERGY LOSS/GAIN CALCULATOR","RAUFRIGO CALCOLO DELLA DISPERSIONE TERMICA","RAUFRIGO CALCUL DES DEPERDITIONS D'ENERGIE","RAUFRIGO CALCULO DE PERDIDA / GANANCIA DE ENERGÍA","RAUFRIGO ENERJİ KAYBI HESABI","РАСЧЕТ ТЕПЛОПОТЕРЬ СИСТЕМЫ RAUFRIGO","RAUFRIGO OBLICZANIE STRAT CHŁODU","RAUFRIGO能量损失计算"]
[null,null,"RAUFRIGO ","180  /  110 x 6,6",{"$f":"IFERROR(VLOOKUP(RAUFRIGO!D4,Berechnung!O15:T26,6,FALSE),\"\")","v":"SDR 17"},{"$nulls":17},4,{"$f":"AF2","v":"Français"},null,null,3,"Rohrleitungsabschnitt: ","Rohrleitungsabschnitt: ","Pipe section","Tratto di tubazione: ","Tronçon du réseau : ","Sección de tubería","Boru devresi kısmı:","Участок трубопровода","Odcinek instalacji","管段："]
[{"$nulls":22},5,{"$f":"AG2","v":"Español"},null,null,4,"Rohrlänge","Rohrlänge","Pipe length","Lunghezza del tubo","Longueur du tronçon","Longitud de tubería","Boru uzunluğu","Длина труб","Długość rury","管路长度"]
[{"$nulls":22},6,{"$f":"AH2","v":"Türkçe"},null,null,5,"Geschwindigkeit","Geschwindigkeit","Velocity","Velocità del fluido","Vitesse","Velocidad","Hız","Скорость","Prędkość","速度"]
[null,null,{"$f":"IF(AR26=1,AR24,\"\")","v":""},{"$nulls":7},{"$f":"HLOOKUP($AC$1,$AB$2:$CA$999,21,0)","v":"T Medium log"},{"$nulls":11},7,{"$f":"AI2","v":"Русский"},null,null,6,"Außentemperatur (Luft)","Außentemperatur (Luft)","External temperature (air)","Temperatura esterna (aria)","Température extérieure (Air)","Temperatura Exterior (aire)","Dış sıcaklık (Hava)","Наружная температура (воздуха)","Temperatura zewnęrzna (powietrza)","外部温度（空气）"]
[{"$nulls":8},{"$f":"HLOOKUP($AC$1,$AB$2:$CA$999,22,0)","v":"T Medium ein"},null,{"$f":"IFERROR(Berechnung!E67,\"-\")","v":{"v":10.019769489826874,"d":" 10.02 °C"}},null,null,{"$f":"HLOOKUP($AC$1,$AB$2:$CA$999,23,0)","v":"T Medium aus"},{"$nulls":8},8,{"$f":"AJ2","v":"Polski"},null,null,7,"Dichte Medium","Dichte Medium","Fluid density","Densità del fluido","Densité du fluide transporté","Densidad de Fluido","Akışkanın yoğunluğu","Плотность теплоносителя","Gęstość medium","媒介密度"]
[null,null,"D2",{"$f":"HLOOKUP($AC$1,$AB$2:$CA$999,17,0)","v":"Aussendurchmesser Basisrohr"},null,null,"[mm]",null,10,{"$nulls":4},{"$f":"IFERROR(Berechnung!B73,\"-\")","v":{"v":10.039525529513027,"d":"10.04 °C"}},{"$nulls":8},9,{"$f":"AK2","v":"汉语"},null,null,8,"relative Luftfeuchtigkeit","relative Luftfeuchtigkeit","Relative humidity","Umidità relativa dell'aria","Pourcentage d'hulidité","Humedad Relativa","Bağıl nem","относительная влажность воздуха","Wilgotność względna","相对空气湿度"]
[null,null,"s",{"$f":"HLOOKUP($AC$1,$AB$2:$CA$999,18,0)","v":"Wandstärke Basisrohr"},null,null,"[mm]",{"$nulls":15},10,{"$nulls":3},9,"innerer Wärmeübergangskoeffizient","innerer Wärmeübergangskoeffizient","Inner film coefficient","Coefficiente di convezione termica (interno)","Coefficient de transfert thermique intérieur","Coeficiente de película interior","İç ısı transfer katsayısı","коэффициент теплоотдачи внутри","Wewnętrzny wsp. przenikania ciepła","内部传热系数"]
[null,null,"D3",{"$f":"HLOOKUP($AC$1,$AB$2:$CA$999,19,0)","v":"Mantelrohrdurchmesser"},null,null,"[mm]",{"$nulls":19},10,"äußerer Wärmeübergangskoeffizient","äußerer Wärmeübergangskoeffizient","Outer film coefficient","Coefficiente di convezione termica (esterno)","Coefficient de transfert thermique extérieur","Coeficiente de película exterior","Dış ısı transfer katsayısı","коэффициент теплоотдачи снаружи","Zewnętrzny wsp. przenikania ciepła","外部传热系数"]
[{"$nulls":3},{"$f":"HLOOKUP($AC$1,$AB$2:$CA$999,20,0)","v":"Rohrreihe"},{"$nulls":22},11,"Wärmeleitfähigkeit PE100","Wärmeleitfähigkeit PE100","Thermal conductivity PE100","Coefficiente conduttività termica PE100","Conductivité thermique PE100","Conductividad térmica PE100","Isıl iletkenlik PE100","теплопроводность ПЭ 100","Wsp. przewodzenia ciepła PE100","导热率 PE 100"]
[{"$nulls":26},12,"Wärmeleitfähigkeit max PUR-Schaum","Wärmeleitfähigkeit max PUR-Schaum","Thermal conductivity max PUR-Foam","Coefficiente conduttività termica max Schiuma PUR","Conductivité thermique max mousse PUR","Conductividad térmica PE100 max espuma PUR","Isıl iletkenlik Lmax PUR-Köpük","теплопроводность  max ППУ","Wsp. przewodzenia ciepła Lmax pianki PUR","导热率 λmax PUR泡沫"]
[{"$nulls":9},{"$f":"IF(I9<F17,HLOOKUP($AC$1,$AB$2:$CA$999,24,0),HLOOKUP($AC$1,$AB$2:$CA$999,25,0))","v":"Kältedämmung"},{"$nulls":16},13,"Wärmeleitfähigkeit verzinktes Stahlblech","Wärmeleitfähigkeit verzinktes Stahlblech","Thermal conductivity galvanised steel casing","Coefficiente conduttività termica lamiera zincata","Conductivité thermique gaine en acier galvalisé","Conductividad térmica protección de acero galvanizado","Isıl iletkenlik Galvanize sac levha"," теплопроводность оцинкованной стальной оболочки","Wsp. przewodzenia ciepła Ocynkowana blacha stalowa","导热率 镀锌钢板"]
[null,null,"L",{"$f":"HLOOKUP($AC$1,$AB$2:$CA$999,4,0)","v":"Rohrlänge"},null,200,"[m]",{"$nulls":19},14,"spezifische Wärmekapazität gemittelt","spezifische Wärmekapazität gemittelt","Average specific heat capacity","Capacità calorifica specifica","Capacité calorifique moyenne spéciale","Capacidad de calor específico promedio","Ortalama özgül ısıl kapasite","средняя удельная теплоемкость","Właściwa pojemność cieplna","平均比热容"]
[null,null,"w",{"$f":"HLOOKUP($AC$1,$AB$2:$CA$999,5,0)","v":"Geschwindigkeit"},null,1,"[m/s]",null,null,"Q",{"$f":"IF(L16>0,HLOOKUP($AC$1,$AB$2:$CA$999,26,0),HLOOKUP($AC$1,$AB$2:$CA$999,27,0))","v":"Kälteverlust"},{"$f":"IFERROR(Berechnung!B67*Berechnung!B68*(RAUFRIGO!I9-RAUFRIGO!N9)*1000,\"-\")","v":{"v":-1235.9617307537117,"d":"-1235.96"}},"[W]",{"$nulls":11},{"$f":"HLOOKUP($AC$1,$AB$2:$AZ$999,43,0)","v":"Nutzungsbedingungen"},null,15,"(bei Wasser -20°C bis +15°C)","(bei Wasser -20°C bis +15°C)","(for water -20°C to +15°C)","(con acqua da -20°C a +15°C)","(Pour l'eau de -20°C à +15°C)","(para agua -20°C a +15°C)","(-20°C - +15°C sıcaklıkta su için)","(для воды от -20°C до +15°C)","(dla wody -20°C - +15°C)","（对于水-20°C至+15°C）"]
[null,null,"Ta",{"$f":"HLOOKUP($AC$1,$AB$2:$CA$999,6,0)","v":"Außentemperatur (Luft)"},null,30,"[°C]",null,null,"V",{"$f":"HLOOKUP($AC$1,$AB$2:$CA$999,28,0)","v":"Volumenstrom"},{"$f":"IFERROR(Berechnung!E30,\"-\")","v":{"v":26.4937294317359,"d":"26.494"}},"[m3/h]",{"$nulls":13},16,"RAUFRIGO benutzerdefinierte Dimension","RAUFRIGO benutzerdefinierte Dimension","RAUFRIGO Bespoke dimensions","RAUFRIGO Dimensione definita dall'utente","RAUFRIGO Dimension personnalisée","RAUFRIGO Dimension personalizada","RAUFRIGO kullanıcı tanımlı çap","RAUFRIGO размер, определяемый потребителем","Śednice RAUFRIGO zdefiniowane przez użytkownika","RAUFRIGO用户自定义尺寸"]
[null,null,"",{"$f":"HLOOKUP($AC$1,$AB$2:$CA$999,7,0)","v":"Dichte Medium"},null,1000,"[kg/m3]",null,null,"m",{"$f":"HLOOKUP($AC$1,$AB$2:$CA$999,29,0)","v":"Massenstrom"},{"$f":"IFERROR(L17*F18,\"-\")","v":{"v":26493.7294317359,"d":"26494"}},"[kg/h]",{"$nulls":13},17,"Aussendurchmesser Basisrohr","Aussendurchmesser Basisrohr","Outer diameter base pipe","Diametro esterno tubo interno","Dimension du tube extérieur tube coloporteur","Diámetro exterior tubo base","Izolasyon kalınlığı Akışkan taşıyıcı boru","Ннаружный диаметр базовой трубы","Średnica zewnętrza rura bazowa","外径基管",{"$nulls":6},{"$f":"SUM(AR27,AR28,AR29)","v":0}]
[null,null,"r",{"$f":"HLOOKUP($AC$1,$AB$2:$CA$999,8,0)","v":"relative Luftfeuchtigkeit"},null,60,"[%]",null,null,"TTau",{"$f":"HLOOKUP($AC$1,$AB$2:$CA$999,30,0)","v":"Taupunkttemperatur"},{"$f":"IFERROR(Berechnung!L61,\"-\")","v":{"v":21.380911788383347,"d":"21.38"}},"[°C]",{"$nulls":7},{"$f":"U26","v":"Version 1.4_08/19"},{"$nulls":5},18,"Wandstärke Basisrohr","Wandstärke Basisrohr","Wall thickness base pipe","Spessore del tubo tubo interno","Epaisseur tube caloporteur","Espesor de pared tubo base","Et kalınlığı Akışkan taşıyıcı boru","Толщина стенки базовой трубы","Grubość ścianki rura bazowa","壁厚基管"]
[{"$nulls":9},"TMedium",{"$f":"HLOOKUP($AC$1,$AB$2:$CA$999,31,0)","v":"Temperaturdifferenz Medium"},{"$f":"IFERROR(N9-I9,\"-\")","v":{"v":0.03952552951302657,"d":"0.040"}},"[K]",{"$nulls":13},19,"Mantelrohrdurchmesser","Mantelrohrdurchmesser","Outer diameter casing","Diametro tubo mantello","Dimension de la gaine extérieure","Diámetro exterior de cubierta","Dış boru çapı","диаметр оболочки","Średnica rury z płaszczem","套管外径",{"$nulls":6},{"$f":"HLOOKUP($AC$1,$AB$2:$CA$999,54,0)","v":"Benutzerdefiniert"}]
[{"$nulls":20},"Versionsnachverfolgung",{"$nulls":5},20,"Rohrreihe","Rohrreihe","Pipe series","Standard Dimension Ratio","Série du tube","Serie de tubería","Boru sırası","серия труб","Typoszereg","管系列"]
[null,null,"i",{"$f":"HLOOKUP($AC$1,$AB$2:$CA$999,9,0)","v":"innerer Wärmeübergangskoeffizient"},null,{"v":100,"d":"100.0"},"[W/m2K]",{"$nulls":13},"Version 1.0_07/13","Erste Version mit Deutsch, Spanisch, Italienisch, Französisch",{"$nulls":4},21,"T Medium log","T Medium log","T Medium log","T Fluido log","Tfluide transporté log","T Medium log","T Akışkan log","T теплоносителя log","T Medium log","T 介质 log"]
[null,null,"a",{"$f":"HLOOKUP($AC$1,$AB$2:$CA$999,10,0)","v":"äußerer Wärmeübergangskoeffizient"},null,{"v":5,"d":"5.000"},"[W/m2K]",{"$nulls":3},{"$f":"HLOOKUP($AC$1,$AB$2:$CA$999,33,0)","v":"Taupunkttiefe am Basisrohr"},{"$f":"IFERROR(IF(I9>=F17,HLOOKUP($AC$1,$AB$2:$CA$999,42,0),IF(Berechnung!Q38<L24,IF(Berechnung!Q38<0,HLOOKUP($AC$1,$AB$2:$CA$999,41,0),Berechnung!Q38),\"im Medium\")),\"-\")","v":{"v":13.028136979228305,"d":"13.0"}},"[mm]",{"$f":"IF(OR(L23=HLOOKUP($AC$1,$AB$2:$CA$999,41,0),K25=HLOOKUP($AC$1,$AB$2:$CA$999,36,0)),HLOOKUP($AC$1,$AB$2:$CA$999,39,0),\"\")","v":""},{"$nulls":6},"Version 1.1_07/13","Aufnahme Türkisch und Hinweismeldung bei Nutzung nach dem 31.12.2015",{"$nulls":4},22,"T Medium ein","T Medium ein","T Medium in","T Fluido in","Tfluide transporté entrant","T Medium interior","T Akışkan iç","T теплоносителя вх.","T Medium dopływ","T 介质 进入"]
[null,null,"1",{"$f":"HLOOKUP($AC$1,$AB$2:$CA$999,11,0)","v":"Wärmeleitfähigkeit PE100"},null,0.41,"[W/mK]",{"$nulls":3},{"$f":"HLOOKUP($AC$1,$AB$2:$CA$999,38,0)","v":"Isolierstärke PUR"},{"$f":"IFERROR(IF((((Berechnung!H45-Berechnung!H44)*1000/2)<0),\"!!! 0 !!!\",(Berechnung!H45-Berechnung!H44)*1000/2),\"-\")","v":{"v":34.99999999999999,"d":"35.0"}},"[mm]",{"$f":"IF((((Berechnung!H45-Berechnung!H44)*1000/2)<0),HLOOKUP($AC$1,$AB$2:$CA$999,39,0),\"\")","v":""},{"$nulls":6},"Version 1.2_09/14","Aufnahme weiterer Sprachen",{"$nulls":4},23,"T Medium aus","T Medium aus","T Medium out","T Fluido out","Tfluide transporté sortant","T Medium exterior","T Akışkan dış","T теплоносителя вых.","T Medium odpływ","T 介质 流出",{"$nulls":6},{"$f":"HLOOKUP($AC$1,$AB$2:$CA$999,52,0)","v":"Bitte Werte benutzerdefiniertes Rohr eintragen:  "}]
[null,null,"2",{"$f":"HLOOKUP($AC$1,$AB$2:$CA$999,12,0)","v":"Wärmeleitfähigkeit max PUR-Schaum"},null,0.028,"[W/mK]",{"$nulls":3},{"$f":"IF(AND((5)<=L23,L23<=L24),HLOOKUP($AC$1,$AB$2:$CA$999,35,0),IF(AND(L23<(5),L23>=0),HLOOKUP($AC$1,$AB$2:$CA$999,36,0),\"\"))","v":"Taupunkt liegt in der Isolierung"},{"$nulls":9},"Version 1.3_03/17","Aufnahme Chinesisch",{"$nulls":4},24,"Kältedämmung","Kältedämmung","Insulation against energy gain","Isolamento per il freddo","Isolation thermique froide","Aislamiento contra ganancia de energía","Soğuk yalıtımı","теплоизоляция холодопроводов","Izolacja termiczna","防止能量增益的绝热",{"$nulls":6},{"$f":"HLOOKUP($AC$1,$AB$2:$CA$999,53,0)","v":"Bitte benutzerdefinierte Werte löschen:"}]
[null,null,"3",{"$f":"HLOOKUP($AC$1,$AB$2:$CA$999,13,0)","v":"Wärmeleitfähigkeit verzinktes Stahlblech"},null,60,"[W/mK]",{"$nulls":13},"Version 1.4_08/19","Korrektur Zellenbezug K23 und K24",{"$nulls":4},25,"Wärmedämmung","Wärmedämmung","Insulation against energy loss","Isolamento per il caldo","isolation thermique chaude","Aislamiento contra pérdida de energía","Isı yalıtımı","теплоизоляция теплопроводов","Izolacja termiczna","防止能量损失的隔热",{"$nulls":5},"Benutzerdefiniert",{"$f":"IF(D4=AR20,1,\"0\")","v":"0"}]
[null,null,"cp",{"$f":"HLOOKUP($AC$1,$AB$2:$CA$999,14,0)","v":"spezifische Wärmekapazität gemittelt"},null,4.249,"[kJ/kgK]",{"$nulls":3},{"$f":"HLOOKUP($AC$1,$AB$2:$CA$999,37,0)","v":"Taupunkttiefe am ESM-Fitting"},{"$f":"IFERROR(IF(I9>=F17,HLOOKUP($AC$1,$AB$2:$CA$999,42,0),IF(Berechnung!Q39<L24,IF(Berechnung!Q39<0,HLOOKUP($AC$1,$AB$2:$CA$999,41,0),Berechnung!Q39),\"im Medium\")),\"-\")","v":{"v":6.882497187749567,"d":"6.9"}},"[mm]",{"$f":"IF(OR(L27=HLOOKUP($AC$1,$AB$2:$CA$999,41,0),K29=HLOOKUP($AC$1,$AB$2:$CA$999,36,0)),HLOOKUP($AC$1,$AB$2:$CA$999,39,0),\"\")","v":""},{"$nulls":12},26,"Wärmeverlust","Wärmeverlust","Energy gain","Dispersione termica calda","Perte en ligne chaude","Ganancia de energía","Isı kaybı","теплопотери","Strata ciepła","能量增益",{"$nulls":5},"Außendurchmesser",{"$f":"IF(F9>0,1,\"0\")","v":"0"}]
[{"$nulls":3},{"$f":"HLOOKUP($AC$1,$AB$2:$CA$999,15,0)","v":"(bei Wasser -20°C bis +15°C)"},{"$nulls":6},{"$f":"HLOOKUP($AC$1,$AB$2:$CA$999,38,0)","v":"Isolierstärke PUR"},{"$f":"IFERROR(IF((((Berechnung!H57-Berechnung!H56)*1000/2)<0),\"!!! 0 !!!\",(Berechnung!H57-Berechnung!H56)*1000/2),\"-\")","v":{"v":19.99999999999999,"d":"20.0"}},"[mm]",{"$f":"IFERROR(IF((((Berechnung!H57-Berechnung!H56)*1000/2)<0),HLOOKUP($AC$1,$AB$2:$CA$999,39,0),\"\"),\"-\")","v":""},{"$nulls":12},27,"Kälteverlust","Kälteverlust","Energy loss","Dipersione termica fredda","Perte en ligne froide","Pérdida de energía","Soğuk kaybı","холодопотери","Strata chłodu","能量损失",{"$nulls":5},"Wandstärke",{"$f":"IF(F10>0,1,\"0\")","v":"0"}]
[{"$nulls":10},{"$f":"IF(AND((5)<=L27,L27<=L28),HLOOKUP($AC$1,$AB$2:$CA$999,35,0),IF(AND(L27<(5),L27>=0),HLOOKUP($AC$1,$AB$2:$CA$999,36,0),\"\"))","v":"Taupunkt liegt in der Isolierung"},{"$nulls":15},28,"Volumenstrom","Volumenstrom","Flow rate by volume","Portata","Débit","Velocidad de flujo por volúmen","Hacim debisi","объемный расход","Przepływ","体流量",{"$nulls":5},"Mantelrohrdurchmesser",{"$f":"IF(F11>0,1,\"0\")","v":"0"}]
[{"$nulls":26},29,"Massenstrom","Massenstrom","Flow rate by mass","Flusso di massa","Débit massique","Celocidad de flujo por masa","Kütle debisi","массовый расход","Przepływ masowy","质量流量"]
{"$rows_left_out":28}
{"sheet":"Berechnung","index":2,"n_rows":82,"n_cols":26,"rows_kept":82,"hidden":true}
[]
[{"$nulls":7},"aa","äußerer Wärmeübergangskoeffizient",{"$nulls":5},"Ausführung\n\n","Mediumrohr\nAußend.\n[mm]","s\n\n[mm]","SDR\n\n","D ESM-\nMuffe\n[mm]","D/2 ESM-Muffe\n[mm]","Muffenm.\nZapfen\n[mm]","Zapfen-\nhöhe\n[mm]","Isolierung\nmin.\n[mm]","Außend.\nGesamt\n[mm]","gewählter\nWickelfalzd.\n[mm]","s\n\n[mm]"]
[{"$nulls":7},"d3","Außendurchmesser PUR-Schaum",{"$f":"C20","v":0.18},"[m]"]
[{"$nulls":7},"tO","Oberflächentemperatur",{"$f":"B37","v":{"v":27.826666075540288,"d":"27.8"}},"[°C]",{"$nulls":3},"standard",63,5.8,11,82,{"$f":"S4/2","v":{"v":41,"d":"41.0"}},58,{"$f":"U4-T4","v":{"v":17,"d":"17.0"}},20,{"$f":"(T4+W4)*2","v":122},140,0.6]
[{"$nulls":7},"tL","Lufttemperatur",{"$f":"C14","v":30},"[°C]",{"$nulls":3},"standard",75,6.8,11,98,{"v":49,"d":"49.0"},65,{"v":16,"d":"16.0"},20,138,150,0.6]
[{"$nulls":14},"standard",90,5.4,17,117,58.5,69,10.5,20,157,160,0.6]
[{"$nulls":14},"standard",110,6.6,17,140,{"v":70,"d":"70.0"},79,{"v":9,"d":"9.0"},20,180,180,0.6]
[{"$nulls":14},"standard",125,7.4,17,157,78.5,87,8.5,20,197,200,0.6]
["Q","Wärmestrom",{"$f":"((PI()*(C13-C14))/((1/(C11*C18))+((1/(2*C15))*LN(C19/C18))+((1/(2*C16))*LN(C20/C19))+((1/(2*C17))*LN(C21/C20))+(1/(C12*C21))))*C10","v":{"v":-1237.1846562274743,"d":"-1237.1847"}},"[W]","ohne T log Mittel !!!",null,null,"d t","Lufttemperatur",{"$f":"ABS(J4-J5)","v":2.173333924459712},"[°C]",{"$nulls":3},"standard",160,9.5,17,200,{"v":100,"d":"100.0"},113,{"v":13,"d":"13.0"},20,240,250,0.6]
["l","Länge",{"$f":"RAUFRIGO!F15","v":200},"[m]",{"$nulls":3},"Waagerechtes Rohr in Innenräumen und im Freien bei Windstille",{"$nulls":6},"standard",180,10.7,17,223,111.5,128,16.5,20,263,280,0.6]
["ai","innerer Wärmeübergangskoeffizient",{"$f":"RAUFRIGO!F22","v":{"v":100,"d":"100.0"}},"[W/(m2K)]",{"$nulls":3},"wenn","d3 * d t =< 1 m3K",{"$f":"C20*J9","v":0.3912001064027481},"dann",{"$nulls":3},"standard",225,13.4,17,280,{"v":140,"d":"140.0"},140,{"v":0,"d":"0.0"},20,320,315,0.6]
["aa","äußerer Wärmeübergangskoeffizient",{"$f":"RAUFRIGO!F23","v":{"v":5,"d":"5.000"}},"[W/(m2K)]","(bei Konvektion u Strahlung)"]
["ti","Innentemperatur (Eintritt)",{"$f":"RAUFRIGO!I9","v":10},"[°C]"]
["ta","Außentemperatur (Luft)",{"$f":"RAUFRIGO!F17","v":30},"[°C]",{"$nulls":5},{"$f":"(POWER((J9/J3),(1/4)))*1.22","v":{"v":2.274172057928926,"d":"2.274"}},"[W/(m2K)]",{"$nulls":4},"Innend. PE100-Rohr","Außend. PE100-Rohr","Außend. PUR-Schaum","Außend. verz.Stahlblech","SDR","Außend. ESM","Länge ESM",null,"PE-Rohr\n","Außend. ESM"]
["l1","Wärmeleitfähigkeit PE100",{"$f":"RAUFRIGO!F24","v":0.41},"[W/(mK)]",{"$nulls":10},"140  /  63 x 5,8",0.0514,0.063,{"v":0.14,"d":"0.140"},0.14120000000000002,"SDR 11",0.082,0.118,null,20,36.001]
["l2","Wärmeleitfähigkeit PUR-Schaum",{"$f":"RAUFRIGO!F25","v":0.028},"[W/(mK)]",{"$nulls":4},"(laminare Luftströmung)",{"$nulls":5},"150  /  75 x 6,8",{"v":0.061399999999999996,"d":"0.0614"},0.075,{"v":0.15,"d":"0.150"},0.1512,"SDR 11",0.098,0.126,null,25,36.001]
["l3","Wärmeleitfähigkeit verzinktes Stahlblech",{"$f":"RAUFRIGO!F26","v":60},"[W/(mK)]","???",{"$nulls":9},"160  /  90 x 5,4",{"v":0.07919999999999999,"d":"0.0792"},{"v":0.09,"d":"0.090"},{"v":0.16,"d":"0.160"},0.1612,"SDR 17",0.117,0.148,null,32,44.001]
["d1","Innendurchmesser PE100-Rohr",{"$f":"Berechnung!Q29","v":0.0968},"[m]",{"$nulls":3},"ai","innerer Wärmeübergangskoeffizient",{"$nulls":5},"180  /  110 x 6,6",0.0968,{"v":0.11,"d":"0.110"},{"v":0.18,"d":"0.180"},0.1812,"SDR 17",{"v":0.14,"d":"0.140"},0.163,null,40,55.001]
["d2","Außendurchmesser PE100-Rohr",{"$f":"Berechnung!Q30","v":0.11},"[m]",{"$nulls":3},"Näherungsgleichung für Wasser (nach Stender und Merkel) für tf<100°C",{"$nulls":6},"200  /  125 x 7,4",{"v":0.11019999999999999,"d":"0.1102"},0.125,{"v":0.2,"d":"0.200"},0.20120000000000002,"SDR 17",0.157,0.173,null,50,68.001]
["d3","Außendurchmesser PUR-Schaum",{"$f":"Berechnung!Q31","v":0.18},"[m]",{"$nulls":3},"tein","Eintrittstemperatur",{"$f":"C31","v":10},"[°C]",{"$nulls":3},"250  /  160 x 9,5",{"v":0.14100000000000001,"d":"0.1410"},{"v":0.16,"d":"0.160"},{"v":0.25,"d":"0.250"},0.2512,"SDR 17",{"v":0.2,"d":"0.200"},0.194,null,63,82.001]
["d4","Außendurchmesser verzinktes Stahlblech",{"$f":"Berechnung!Q32","v":0.1812},"[m]",{"$nulls":3},"taus","Austrittstemperatur",{"$f":"C32","v":{"v":10.039564638148596,"d":"10.0396"}},"[°C]",{"$nulls":3},"280  /  180 x 10,7",0.1586,{"v":0.18,"d":"0.180"},{"v":0.28,"d":"0.280"},0.2812,"SDR 17",0.223,0.211,null,75,98.001]
[{"$nulls":7},"tf","(Tein+Taus)/2",{"$f":"(J20+J21)/2","v":10.019782319074299},"[°C]",{"$nulls":3},"315  /  225 x 13,4",{"v":0.19820000000000002,"d":"0.1982"},0.225,0.315,0.3162,"SDR 17",{"v":0.28,"d":"0.280"},{"v":0.24,"d":"0.240"},null,90,117.001]
[{"$nulls":7},"w","Geschwindigkeit",{"$f":"RAUFRIGO!F16","v":1},"[m/s]",{"$nulls":3},"355  /  250 x 14,8",0.2204,{"v":0.25,"d":"0.250"},0.355,0.3562,"SDR 17",{"v":0.31,"d":"0.310"},0.256,null,110,140.001]
[{"$nulls":7},"d1","Innendurchmesser PE100-Rohr",{"$f":"C18","v":0.0968},"[m]",{"$nulls":3},"400  /  280 x 16,6",0.2468,{"v":0.28,"d":"0.280"},{"v":0.4,"d":"0.400"},0.4012,"SDR 17",0.339,0.275,null,125,157.001]
[{"$nulls":8},"=> ai =",{"$f":"(POWER(J23,0.87)/POWER(J24,0.13))*2040*(1+(0.015*J22))","v":{"v":3178.8955470187134,"d":"3178.9"}},"[W/(m2K)]",{"$nulls":3},"450  /  315 x 18,7",0.2776,0.315,{"v":0.45,"d":"0.450"},0.4512,"SDR 17",0.381,0.284,null,140,176.001]
[{"$nulls":4},"w (m/h)",{"$f":"RAUFRIGO!#REF!/C18/C18/PI()/3600*4","v":{"$error":"#REF!"}},{"$nulls":8},"560  /  355 x 21,1",0.3128,0.355,{"v":0.56,"d":"0.560"},0.5612,"SDR 17",0.436,{"v":0.26,"d":"0.260"},null,160,200.001]
[{"$nulls":4},"w (l/s)",{"$f":"RAUFRIGO!#REF!/C18/C18/PI()/3600*4","v":{"$error":"#REF!"}},{"$nulls":4},"Temp","cp",null,null,{"$f":"HLOOKUP(RAUFRIGO!$AC$1,RAUFRIGO!$AB$2:$CA$999,54,0)","v":"Benutzerdefiniert"},{"$f":"(RAUFRIGO!F9-RAUFRIGO!F10-RAUFRIGO!F10)/1000","v":{"v":0,"d":"0.0000"}},{"$f":"RAUFRIGO!F9/1000","v":{"v":0,"d":"0.000"}},{"$f":"RAUFRIGO!F11/1000","v":{"v":0,"d":"0.000"}},{"$f":"R27+0.0012","v":0.0012},{"$f":"RAUFRIGO!F12","v":0},{"$f":"Y36/1000","v":{"$error":"#N/A"}},null,null,180,223.001]
["p","Dichte Medium",{"$f":"RAUFRIGO!F18","v":1000},"[kg/m3]",{"$nulls":6},-20,4.375,{"$nulls":11},200,249.001]
["cp","spezifische Wärmekapazität",{"$f":"RAUFRIGO!F27","v":4.249},"[kJ/kgK]","gemittelt",null,null,"Angaben von H Dr bei freier Konvektion:",null,null,-15,4.312,null,null,{"$f":"RAUFRIGO!D4","v":"180  /  110 x 6,6"},null,{"$f":"VLOOKUP($O$29,Berechnung!$O$15:$T$27,2)","v":0.0968},{"$f":"VLOOKUP($O$29,Berechnung!$O$15:$U$27,7)","v":{"v":0.14,"d":"0.1400"}},{"$nulls":5},225,280.001]
["V","Volumenstrom",{"$f":"((C18/2)*(C18/2)*PI())*J23","v":{"v":0.007359369286593306,"d":"0.0074"}},"[m3/s] =",{"$f":"C30*3600","v":{"v":26.4937294317359,"d":"26.5"}},"[m3/h]",null,"a(innen)= 100",null,null,-10,4.269,{"$nulls":4},{"$f":"VLOOKUP($O$29,Berechnung!$O$15:$T$27,3)","v":{"v":0.11,"d":"0.1100"}},{"$nulls":6},250,310.001]
{"$rows_left_out":52}