{"text_format":"3","workbook":"xlsx","n_sheets":3,"sheets":["Nutzungsbedingungen","RAUFRIGO","Anlage"],"not_rendered":{"images":5,"defined_names":7},"read":"whole","date_system":"1900"}

{"sheet":"Nutzungsbedingungen","index":0,"n_rows":11,"n_cols":22,"rows_kept":11,"merged":[[3,1,3,9],[4,1,4,9],[5,1,5,9],[6,1,6,9],[7,1,7,9],[8,1,8,9],[9,1,9,9],[11,1,11,9],[12,1,12,9],[13,1,13,9],[14,1,14,9],[15,1,15,9],[16,1,16,9],[17,1,17,9],[18,1,18,9]]}
[{"$nulls":21},{"$f":"HLOOKUP(RAUFRIGO!$AR$1,RAUFRIGO!$AQ$2:$BZ$999,38,0)","v":"Nutzungsbedingungen"}]
[]
[]
[null,{"$f":"HLOOKUP(RAUFRIGO!$AR$1,RAUFRIGO!$AQ$2:$BZ$999,45,0)","v":"REHAU SOFTWARE INDUSTRIEROHRSYSTEM RAUFRIGO"}]
[null,{"$f":"HLOOKUP(RAUFRIGO!$AR$1,RAUFRIGO!$AQ$2:$BZ$999,46,0)","v":"Haftungsausschluss"}]
[null,{"$f":"HLOOKUP(RAUFRIGO!$AR$1,RAUFRIGO!$AQ$2:$BZ$999,47,0)","v":"Copyright © 2013"}]
[null,{"$f":"HLOOKUP(RAUFRIGO!$AR$1,RAUFRIGO!$AQ$2:$BZ$999,48,0)","v":"Alle Daten innerhalb dieser Webseite/Software sind urheberrechtlich geschützt und dürfen nicht ohne Zustimmung der Rechteinhaber verwendet werden. Die durch das Urheberrecht begründeten Rechte, insbesondere die der Übersetzung, des Nachdruckes, der Entnahme von Abbildungen, der Funksendungen, der Wiedergabe auf fotomechanischem oder ähnlichem Wege und der Speicherung in Datenverarbeitungsanlagen, bleiben vorbehalten."}]
[null,{"$f":"HLOOKUP(RAUFRIGO!$AR$1,RAUFRIGO!$AQ$2:$BZ$999,49,0)","v":"Kontakt: info@rehau.com "}]
[null,{"$f":"HLOOKUP(RAUFRIGO!$AR$1,RAUFRIGO!$AQ$2:$BZ$999,50,0)","v":"Datenschutz: Alle innerhalb dieser Webseite vom Anwender eingegebenen und verarbeiteten Daten werden vertraulich gem. § 5 BDSG behandelt und nicht an Dritte weitergegeben. Die Daten werden nur zur Bearbeitung der Anfragen benutzt. "}]
[null,{"$f":"HLOOKUP(RAUFRIGO!$AR$1,RAUFRIGO!$AQ$2:$BZ$999,51,0)","v":"Die Webseite/Software wird von den Herausgebern kostenlos zur Verfügung gestellt. Die Herausgeber übernehmen keinerlei Gewähr für die Aktualität, Korrektheit, zu Grunde gelegte Berechnungsformeln, Berechnungsergebnisse, Vollständigkeit oder Qualität der bereitgestellten Informationen. Haftungsansprüche gegen die Herausgeber und Autoren, die sich auf Schäden materieller oder ideeler Art beziehen, welche durch die Nutzung der dargebotenen Informationen bzw. durch Nutzung fehlerhafter oder unvollständiger Informationen verursacht wurden, sind grundsätzlich ausgeschlossen, sofern seitens der Herausgeber und Autoren kein nachweislich vorsätzliches oder grob fahrlässiges Verschulden vorliegt. Die Herausgeber behalten es sich ausdrücklich vor, Teile der Seiten oder den gesamten Inhalt ohne gesonderte Ankündigung zu verändern, zu ergänzen oder die Veröffentlichung zeitweise oder endgültig einzustellen. Aus der Veröffentlichung kann nicht entnommen werden, dass die verwendeten Bezeichnungen frei von Rechten Dritter sind. Sofern auf Verweisziele („Links“) direkt oder indirekt verwiesen wird, die außerhalb des Verantwortungsbereichs des Herausgebers/Autoren liegen, haften diese allenfalls dann, wenn sie von den Inhalten Kenntnis hatten, und es ihnen technisch möglich und zumutbar wäre, die Nutzung im Falle rechtswidriger Inhalte zu verhindern. Für darüber hinausgehende Inhalte und insbesondere für Schäden, die aus der Nutzung oder Nichtnutzung solcherart dargebotener Informationen entstehen, haftet allein der Anbieter dieser Seiten, nicht derjenige, der über Links auf die jeweilige Veröffentlichung lediglich verweist. Dieser Haftungsausschluss ist als Teil des Internetangebots dieser Seite / dieses Softwareangebots zu betrachten. Sofern Teile oder einzelne Formulierungen dieses Textes der geltenden Rechtslage nicht, nicht mehr oder nicht vollständig entsprechen sollten, bleiben die übrigen Teile des Dokuments in ihrem Inhalt und ihrer Gültigkeit davon unberührt."}]
[null,null,{"$f":"HLOOKUP(RAUFRIGO!$AR$1,RAUFRIGO!$AQ$2:$BZ$999,52,0)","v":"Nutzungsbedingungen akzeptieren"},{"$nulls":6},{"$f":"RAUFRIGO!AD5","v":0}]

{"sheet":"RAUFRIGO","index":1,"n_rows":64,"n_cols":52,"rows_kept":64,"merged":[[3,3,3,7],[5,4,5,6],[6,2,7,3],[7,12,7,13],[32,34,32,38],[33,35,33,38],[34,35,34,38],[35,35,35,38],[36,35,36,38],[37,35,37,38],[38,35,38,38],[39,35,39,38],[40,35,40,38]]}
[{"$nulls":38},1,{"$f":"AR2","v":"Deutsch"},1,null,"Sprache",{"$f":"VLOOKUP(AO1,AM1:AN9,2,FALSE)","v":"Deutsch"}]
[null,null,{"$f":"HLOOKUP($AR$1,$AQ$2:$BZ$999,2,0)","v":"RAUFRIGO DRUCKVERLUSTBERECHNUNG"},{"$nulls":31},{"$f":"HLOOKUP($AR$1,$AQ$2:$BZ$999,55,0)","v":"Benutzerdefiniert"},{"$f":"E8","v":100},{"$f":"G8","v":5},null,2,{"$f":"AS2","v":"English"},null,null,"Original","Deutsch","English","Italiano","Français","Español","Türkçe","Русский","Polski","汉语"]
[{"$nulls":34},{"$f":"AJ3&\" x \"&AK3&\"     \"&AL3","v":"63 x 5,8     SDR  11"},63,5.8,"SDR  11",3,{"$f":"AT2","v":"Italiano"},null,null,"RAUFRIGO DRUCKVERLUSTBERECHNUNG","RAUFRIGO DRUCKVERLUSTBERECHNUNG","RAUFRIGO PRESSURE LOSS CALCULATOR","RAUFRIGO CALCOLO DELLA PERDITA DI PRESSIONE","RAUFRIGO CALCUL DES PERTES DE CHARGES","RAUFRIGO CALCULADORA PARA PERDIDA DE PRESIÓN","RAUFRIGO BASINÇ KAYBI HESABI","РАСЧЕТ ПОТЕРЬ ДАВЛЕНИЯ СИСТЕМЫ RAUFRIGO","RAUFRIGO OBLICZANIE SPADKU CIŚNIENIA","RAUFRIGO压力损失计算"]
[null,null,{"$f":"HLOOKUP($AR$1,$AQ$2:$BZ$999,3,0)","v":"Rohrleitungsabschnitt:"},{"$nulls":6},{"$f":"HLOOKUP($AR$1,$AQ$2:$BZ$999,25,0)","v":"Medium:"},{"$nulls":8},"Re*k/d<65   (HERMANN)",{"$f":"0.0054+(0.396/(M6^0.3))","v":{"v":0.018467952725988453,"d":"0.01847"}},{"$nulls":14},{"$f":"AJ4&\" x \"&AK4&\"     \"&AL4","v":"75 x 6,8     SDR  11"},75,6.8,"SDR  11",4,{"$f":"AU2","v":"Français"},null,null,"Rohrleitungsabschnitt:","Rohrleitungsabschnitt:","Pipe section:","Tratto di tubazione:","Tronçon du réseau :","Selección de tubo:","Boru devresi kısmı:","участок трубопровода","Odcinek instalacji:","管段："]
[{"$nulls":18},"65<Re*k/d<1300   (PRANDTL COLEBROOK)",{"$f":"Anlage!D15","v":{"v":0.01888674103152595,"d":"0.01889"}},{"$nulls":14},"90 x 5,4     SDR  17",90,5.4,"SDR  17",5,{"$f":"AV2","v":"Español"},null,null,"RAUFRIGO - Dimension Basisrohr","RAUFRIGO - Dimension Basisrohr","RAUFRIGO - Dimensions base pipe","RAUFRIGO - tipo di tubo interno","RAUFRIGO - Dimension du tube caloporteur","RAUFRIGO - Dimensiones de tubo base","RAUFRIGO - Akışkan taşıyıcı borunun çapı","RAUFRIGO размеры базовой трубы","RAUFRIGO - Wymiary rury bazowej","RAUFRIGO基管尺寸"]
[null,null,{"$f":"HLOOKUP($AR$1,$AQ$2:$BZ$999,4,0)","v":"RAUFRIGO - Dimension Basisrohr"},null,"110 x 6,6     SDR  17",{"$nulls":4},{"$f":"HLOOKUP($AR$1,$AQ$2:$BZ$999,26,0)","v":"Reynoldszahl:"},"Re","=",{"$f":"IFERROR((M13*(G10-2*G11)/G16/1000*1000000),0)","v":{"v":86754.51855486212,"d":"86,755"}},{"$nulls":5},"Re*k/d>1300   (NIKURADSE)",{"$f":"(1/((2*LOG((G10-G11-G11)/0.007))+1.14))^2","v":{"v":0.011265613780301444,"d":"0.01127"}},{"$nulls":14},"110 x 6,6     SDR  17",110,6.6,"SDR  17",6,{"$f":"AW2","v":"Türkçe"},null,null,"Rohraussendurchmesser:","Rohraussendurchmesser:","Outer pipe diameter:","Diametro esterno:","Diamètre extérieur du tube caloporteur :","Diámetro exterior de tubo:","Boru dış çapı:","наружный диаметр трубы","Średnica zewnętrzna rury","管外径："]
[null,null,{"$f":"IF(AJ26=1,AI23,\"\")","v":""},{"$nulls":31},"125 x 7,4     SDR  17",125,7.4,"SDR  17",7,{"$f":"AX2","v":"Русский"},null,null,"Wandstärke:","Wandstärke:","Wall thickness:","Spessore del tubo:","Epaisseur :","Espesor de pared:","Et kalınlığı:","толщина стенки:","Grubość ścianki:","壁厚："]
[{"$nulls":4},100,"x",{"v":5,"d":"5.0"},"[mm]",null,null,{"$f":"IF(M6<2320,\"Re < 2320\",\"Re > 2320\")","v":"Re > 2320"},null,{"$f":"IF(M6<2320,HLOOKUP($AR$1,$AQ$2:$BZ$999,40,0),HLOOKUP($AR$1,$AQ$2:$BZ$999,41,0))","v":"turbulente Strömung"},{"$nulls":21},"160 x 9,5     SDR  17",160,9.5,"SDR  17",8,{"$f":"AY2","v":"Polski"},null,null,"Volumenstrom:","Volumenstrom:","Flow rate by volume:","Portata in volume:","Débit :","Velocidad de flujo por volúmen:","Hacim debisi:","массовый расход","Przepływ","体流量："]
[{"$nulls":9},{"$f":"HLOOKUP($AR$1,$AQ$2:$BZ$999,27,0)","v":"Rohrreibungszahl:"},"l",null,{"$f":"IFERROR(IF((M6*0.007/(G10-G11-G11))<65,T4,IF((M6*0.007/(G10-G11-G11))<1300,T5,T6)),0)","v":{"v":0.018467952725988453,"d":"0.01847"}},{"$nulls":21},"180 x 10,7     SDR  17",180,10.7,"SDR  17",9,{"$f":"AZ2","v":"汉语"},null,null,"Rohrlänge:","Rohrlänge:","Pipe length:","Lunghezza del tubo:","Longueur du tronçon  :","Lontigud de tubo:","Boru uzunluğu:","длина трубопровода:","Długość rury","管长："]
[null,null,{"$f":"HLOOKUP($AR$1,$AQ$2:$BZ$999,5,0)","v":"Rohraussendurchmesser:"},null,"da","=",{"$f":"VLOOKUP(E6,AI2:AL14,2,FALSE)","v":110},"[mm]",null,null,{"$f":"IFERROR((IF((M6*0.007/(G10-G11-G11))<65,HLOOKUP($AR$1,$AQ$2:$BZ$999,42,0),IF((M6*0.007/(G10-G11-G11))<1300,HLOOKUP($AR$1,$AQ$2:$BZ$999,43,0),HLOOKUP($AR$1,$AQ$2:$BZ$999,44,0)))),0)","v":"hydraulisch glattes Rohr"},{"$nulls":23},"225 x 13,4     SDR  17",225,13.4,"SDR  17",{"$nulls":4},"Temperatur:","Temperatur:","Temperature:","Temperatura del fluido:","Température :","Temperatura:","Sıcaklık:","температура:","Temperatura:","温度："]
[null,null,{"$f":"HLOOKUP($AR$1,$AQ$2:$BZ$999,6,0)","v":"Wandstärke:"},null,"s","=",{"$f":"VLOOKUP(E6,AI2:AL14,3,FALSE)","v":6.6},"[mm]",null,{"$f":"IFERROR((M6*0.007/(G10-G11-G11)),0)","v":{"v":6.273570556653252,"d":"6.3  ="}},{"$f":"IFERROR((IF((M6*0.007/(G10-G11-G11))<65,S4,IF((M6*0.007/(G10-G11-G11))<1300,S5,S6))),0)","v":"Re*k/d<65   (HERMANN)"},"=",{"$nulls":22},"250 x 14,8     SDR  17",250,14.8,"SDR  17",{"$nulls":4},"Dichte:","Dichte:","Density:","Densità del fluido:","Densité:","Densidad:","Yoğunluk:","плотность:","Gęstość:","密度："]
[null,null,{"$f":"HLOOKUP($AR$1,$AQ$2:$BZ$999,7,0)","v":"Volumenstrom:"},null,"V","=",{"v":10,"d":"10.0"},"[l/s]",null,{"$f":"HLOOKUP($AR$1,$AQ$2:$BZ$999,28,0)","v":"Rohrreibungsgefälle:"},"R","=",{"$f":"IFERROR((M9*G15*(M13^2)/(G10-2*G11)/2/10^-3*1000),0)","v":{"v":176.13310320042112,"d":"176"}},"[Pa/m]",{"$nulls":20},"280 x 16,6     SDR  17",280,16.6,"SDR  17",{"$nulls":4},"kinematische Viskosität:","kinematische Viskosität:","Kinematic viscosity:","Viscosità cinematica:","Viscosité cinématique :","Viscosidad cinemática:","Kinematik viskozite:","кинематическая вязкость","Lepkość kinematyczna","运动黏度："]
[null,null,{"$f":"HLOOKUP($AR$1,$AQ$2:$BZ$999,8,0)","v":"Rohrlänge:"},null,"l","=",100,"[m]",null,{"$f":"HLOOKUP($AR$1,$AQ$2:$BZ$999,29,0)","v":"Geschwindigkeit:"},"v","=",{"$f":"IFERROR((G12*4000/((G10-2*G11)^2)/PI()),0)","v":{"v":1.3588120952453329,"d":"1.36"}},"[m/s]",{"$nulls":20},"315 x 18,7     SDR  17",315,18.7,"SDR  17",{"$nulls":4},"Bezeichnung","Bezeichnung","Description","Descrizione","Désignation :","Descripción","Tanımlama","обозначение","Oznaczenie","标记"]
[null,null,{"$f":"HLOOKUP($AR$1,$AQ$2:$BZ$999,9,0)","v":"Temperatur:"},null,"T","=",5,"[°C]",null,{"$f":"HLOOKUP($AR$1,$AQ$2:$BZ$999,30,0)","v":"Massenstrom:"},"m",null,{"$f":"IFERROR((G12*G15*3600),0)","v":{"v":36000.72760446998,"d":"36,001"}},"[kg/h]",{"$nulls":20},"355 x 21,1     SDR  17",355,21.1,"SDR  17",{"$nulls":4},"Winkel 90°","Winkel 90°","Elbow 90°","Angolo 90°","Coude 90°","Codo 90°","90° dirsek","отвод 90°","Kolano 90°","90ﾟ角"]
[null,null,{"$f":"HLOOKUP($AR$1,$AQ$2:$BZ$999,10,0)","v":"Dichte:"},null,"r","=",{"v":1.0000202112352772,"d":"1.00"},"[g/cm3]",{"$nulls":34},"Winkel 45°","Winkel 45°","Elbow 45°","Angolo 45°","Coude 45°","Codo 45°","45° dirsek","отвод 45°","Kolano 45°","45ﾟ角"]
[null,null,{"$f":"HLOOKUP($AR$1,$AQ$2:$BZ$999,11,0)","v":"kinematische Viskosität:"},null,"n","=",{"v":1.5161517003471,"d":"1.52"},"[mm2/s]",null,{"$f":"HLOOKUP($AR$1,$AQ$2:$BZ$999,31,0)","v":"Druckverlust Rohr:"},"DpR","=",{"$f":"M12*G13","v":{"v":17613.31032004211,"d":"17,613"}},"[Pa]",{"$nulls":28},"T-Stück Abzweig","T-Stück Abzweig","T-piece - branch flow","Diramazione \"T\"","Té de dérivation","Pieza T - flujo derivado","T-parçası - Çıkış","тройник на ответвление","Trójnik odejście","三通管 分支流"]
[{"$nulls":9},{"$f":"HLOOKUP($AR$1,$AQ$2:$BZ$999,32,0)","v":"Druckverlust Formteil:"},"DpF","=",{"$f":"SUM(G19:G27)","v":{"v":6462.426696634157,"d":"6,462"}},"[Pa]",{"$nulls":28},"T-Stück Durchgang","T-Stück Durchgang","T-piece - through flow","Passaggio \"T\"","Té de passage","Pieza T - flujo de cruce","T-parçası - Geçiş","тройник на проход","Trójnik przelot","三通管 通流"]
[null,null,{"$f":"HLOOKUP($AR$1,$AQ$2:$BZ$999,12,0)","v":"Bezeichnung"},{"$f":"HLOOKUP($AR$1,$AQ$2:$BZ$999,23,0)","v":"Symbol"},{"$f":"HLOOKUP($AR$1,$AQ$2:$BZ$999,24,0)","v":"Anzahl"},"","Dp",null,null,{"$f":"HLOOKUP($AR$1,$AQ$2:$BZ$999,33,0)","v":"Druckverlust Rohrleitung:"},"Dp","=",{"$f":"SUM(M16+M17)","v":{"v":24075.737016676267,"d":"24,076"}},"[Pa]",{"$nulls":28},"T-Stück Verteilung","T-Stück Verteilung","T-piece - flow splitting","Distributore \"T\"","Té de distribution","Pieza T - flujo dividido","T-parçası - Dağıtım","тройник на разделение потоков","Trónik rozdział","三通管 流分离"]
[null,null,{"$f":"HLOOKUP($AR$1,$AQ$2:$BZ$999,13,0)","v":"Winkel 90°"},null,5,1.3,{"$f":"IFERROR((E19*F19*($G$15/2)*$M$13^2*1000),0)","v":{"v":6000.824789731718,"d":"6,001"}},"[Pa]",null,null,"(1bar=105 Pa)","=",{"$f":"M18/10^5","v":{"v":0.24075737016676266,"d":"0.241"}},"[bar]",{"$nulls":28},"T-Stück Vereinigung","T-Stück Vereinigung","T-piece - flow combining","Congiunzione \"T\"","Té  union","Pieza T - flujo combinado","T-parçası - Birleşim","тройник на слияние потоков","Trónik odejście zbieżny","三通管 流整合"]
[null,null,{"$f":"HLOOKUP($AR$1,$AQ$2:$BZ$999,14,0)","v":"Winkel 45°"},null,null,0.5,0,"[Pa]",{"$nulls":3},{"$f":"SUM(U20+Y14)","v":0},{"$nulls":22},{"$f":"HLOOKUP($AR$1,$AQ$2:$BZ$999,37,0)","v":"Werte auf Medium Wasser zurücksetzen"},{"$nulls":7},"Reduzierung","Reduzierung","Reducer","Riduzione","Réduction","Reductor","Redüksiyon","переход","Zwężka","减缩件"]
[null,null,{"$f":"HLOOKUP($AR$1,$AQ$2:$BZ$999,15,0)","v":"T-Stück Abzweig"},null,null,1.3,0,"[Pa]",null,{"$f":"HLOOKUP($AR$1,$AQ$2:$BZ$999,34,0)","v":"Medium Wasser"},{"$nulls":24},{"$f":"HLOOKUP($AR$1,$AQ$2:$BZ$999,38,0)","v":"Nutzungsbedingungen"},{"$nulls":7},"Absperrschieber","Absperrschieber","Gate valve","Saracinesca","Vanne d'arrêt","Válvula de compuerta","Kesme vanası","запорный шибер","Zasuwa","截止阀"]
[null,null,{"$f":"HLOOKUP($AR$1,$AQ$2:$BZ$999,16,0)","v":"T-Stück Durchgang"},null,null,0.3,0,"[Pa]",null,{"$f":"HLOOKUP($AR$1,$AQ$2:$BZ$999,35,0)","v":"Dichte:"},"r","=",{"$f":"Anlage!F6/1000","v":{"v":1.0000202112352772,"d":"1.00"}},"[g/cm3]",{"$nulls":20},"Abfrage:",{"$f":"SUM(AJ27:AJ28)","v":2},{"$nulls":6},"Kugelhahn","Kugelhahn","Ball valve","Rubinetto sferico","Robinet à boisseau sphérique","Válvula de bola","Küresel vana","шаровой кран","Zawór kulowy","球阀"]
[null,null,{"$f":"HLOOKUP($AR$1,$AQ$2:$BZ$999,17,0)","v":"T-Stück Verteilung"},null,null,1.5,0,"[Pa]",null,{"$f":"HLOOKUP($AR$1,$AQ$2:$BZ$999,36,0)","v":"kinematische Viskosität:"},"n","=",{"$f":"(1.78*10^-6)/(1+0.0337*G14+0.000221*G14^2)*1000000","v":{"v":1.5161517003470961,"d":"1.52"}},"[mm2/s]",{"$nulls":20},{"$f":"HLOOKUP($AR$1,$AQ$2:$BZ$999,53,0)","v":"Bitte Werte benutzerdefiniertes Rohr eintragen:  "},{"$nulls":7},"Druckverlust Formteile gesamt","Druckverlust Formteile gesamt","Total pressure loss fittings","Perdita complessiva pezzi stampati","Perte de charges totale des raccords","Pérdida de presión total en accesorios","Fittinglerin toplam basınç kaybı","сумма потерь давления на местные сопротивления","Łączny spadek ciśnienia dla kształtek","型件总体的压力损失"]
[null,null,{"$f":"HLOOKUP($AR$1,$AQ$2:$BZ$999,18,0)","v":"T-Stück Vereinigung"},null,null,1.3,0,"[Pa]",{"$nulls":26},{"$f":"HLOOKUP($AR$1,$AQ$2:$BZ$999,54,0)","v":"Bitte benutzerdefinierte Werte löschen:"},{"$nulls":7},"Symbol","Symbol","Symbol","Symbol","Symbole","Simbolo","Sembol","символ","Symbol","标志"]
[null,null,{"$f":"HLOOKUP($AR$1,$AQ$2:$BZ$999,19,0)","v":"Reduzierung"},null,1,0.4,{"v":369.28152552195195,"d":"369"},"[Pa]",{"$nulls":26},{"$f":"HLOOKUP($AR$1,$AQ$2:$BZ$999,55,0)","v":"Benutzerdefiniert"},{"$nulls":7},"Anzahl","Anzahl","Quantity","Quantità","Quantité","Cantidad","Adet","количество","Ilość","数量"]
[null,null,{"$f":"HLOOKUP($AR$1,$AQ$2:$BZ$999,20,0)","v":"Absperrschieber"},null,null,0.5,0,"[Pa]",{"$nulls":26},"Benutzerdefiniert",{"$f":"IF(E6=AI2,1,\"0\")","v":"0"},{"$nulls":6},"Medium:","Medium:","Medium:","Fluido:","Fluide transporté :","Medio:","Akışkan:","транспортируемая среда:","Medium:","媒介："]
[null,null,{"$f":"HLOOKUP($AR$1,$AQ$2:$BZ$999,21,0)","v":"Kugelhahn"},null,1,0.1,{"v":92.32038138048799,"d":"92"},"[Pa]",{"$nulls":26},"Angabe da",{"$f":"IF(E8>0,1,\"0\")","v":1},{"$nulls":6},"Reynoldszahl:","Reynoldszahl:","Reynolds number:","Coefficiente Reynolds:","Nombre de Reynold:","Número Reynolds:","Reynolds-sayısı:","число Рейнольдса:","Liczba Reynoldsa","雷诺数："]
[null,null,{"$f":"HLOOKUP($AR$1,$AQ$2:$BZ$999,22,0)","v":"Druckverlust Formteile gesamt"},{"$nulls":3},{"$f":"SUM(G19:G27)","v":{"v":6462.426696634157,"d":"6,462"}},"[Pa]",{"$nulls":26},"Angabe di",{"$f":"IF(G8>0,1,\"0\")","v":1},{"$nulls":6},"Rohrreibungszahl:","Rohrreibungszahl:","Pipe friction coefficient:","Coefficiente di attrito del tubo:","Coefficient de rugosité tube :","Coeficiente de fricción de tubo:","Boru sürtünme katsayısı:","коэффициент шероховатости:","Współczynnik tarcia","管摩擦系数："]
[{"$nulls":42},"Rohrreibungsgefälle:","Rohrreibungsgefälle:","Head loss pipe:","Perdita di carico per attrito:","Coefficient de frottement tube :","Pérdida de carga de tubo:","Boru basınç düşümü:","удельные потери на трение:","Spadek hydrauliczny","管摩擦扬程损失："]
[{"$nulls":42},"Geschwindigkeit:","Geschwindigkeit:","Velocity:","Velocità:","Vitesse :","Velocidad: ","Hız:","скорость:","Prędkość","速度："]
[{"$nulls":34},{"$f":"AI37","v":"Version 1.3_03/17"},{"$nulls":7},"Massenstrom:","Massenstrom:","Flow rate by mass","Flusso di massa:","Débit massique :","Velocidad de flujo por masa:","Kütle debisi:","массовый расход:","Przepływ masowy","质量流量："]
[{"$nulls":42},"Druckverlust Rohr:","Druckverlust Rohr:","Pressure loss pipes","Perdita di pressione tubo:","Perte de charge tubes :","Pérdida de presión de tuberías:","Borunun basınç kaybı:","потери давления на трение:","Spadek ciśneinia dla rur","压力损失 管："]
[{"$nulls":34},"Versionsnachverfolgung",{"$nulls":7},"Druckverlust Formteil:","Druckverlust Formteil:","Pressure loss fittings","Perdita di pressione pezzi stampati:","Perte de charge raccords :","Pérdida de presión de accesorios:","Fittinglerin basınç kaybı:","потери давления на местные сопротивления:","Spadek ciśnienia dla kształtek","压力损失 型件："]
[{"$nulls":34},"Version 1.0_07/13","Erste Version mit Deutsch, Spanisch, Italienisch, Französisch",{"$nulls":6},"Druckverlust Rohrleitung:","Druckverlust Rohrleitung:","Pressure loss pipe section","Perdita di pressione conduttura:","Perte de charge tronçon :","Pérdida de presión de sección de tubería:","Boru hattının basınç kaybı:","потери давления в трубопроводе:","Spadek ciśnienia dla rurociągu","压力损失 管路："]
[{"$nulls":34},"Version 1.1_07/13","Aufnahme Türkisch und Hinweismeldung bei Nutzung nach dem 31.12.2015",{"$nulls":6},"Medium Wasser","Medium Wasser","Medium water","Fluido Acqua","Eau transportée","Agua media","Akışkan su:","теплоноситель вода","Medium woda","媒介水"]
[{"$nulls":34},"Version 1.2_09/14","Erweiterung Sprachen",{"$nulls":6},"Dichte:","Dichte:","Density:","Densità:","Densité :","Densidad:","Yoğunluk:","плотность:","Gęstość:","密度："]
[{"$nulls":34},"Version 1.3_03/17","Aufnahme Chinesisch",{"$nulls":6},"kinematische Viskosität:","kinematische Viskosität:","Kinematic viscosity:","Viscosità cinematica:","Viscosité cinématique :","Viscosidad cinemática:","Kinematik viskozite:","кинематическая вязкость","Lepkość kinematyczna","运动黏度："]
[{"$nulls":42},"Werte auf Medium Wasser zurücksetzen","Werte auf Medium Wasser zurücksetzen","Use values for water in entry fields","Inserire automaticamente nella tabella  i valori per densita e viscosità ","Prendre la valeur dans le champ de saisi","Usar valores para agua en los campos requeridos","Değerleri tekrar Su için güncelle","ввести значения коэффициентов для воды","Powrót do wartości medium woda","在输入区域使用水的值"]
[{"$nulls":42},"Nutzungsbedingungen","Nutzungsbedingungen","Terms & Conditions of use","Condizioni de utilizzo","Conditions d'utilisation","Térmnos y condiciones de uso","Kullanım koşulları","условия использования","Warunki użytkowania","使用条件"]
[{"$nulls":42},"www.rehau.de/raufrigo","www.rehau.de/raufrigo","www.rehau.com","www.rehau.com","www.rehau.com","www.rehau.com","www.rehau.com.tr","www.rehau.de/raufrigo","http://www.rehau.com/pl-pl","www.rehau.com"]
{"$rows_left_out":25}
{"sheet":"Anlage","index":2,"n_rows":29,"n_cols":14,"rows_kept":29,"hidden":true}
["Dichteberechnung Wasser"]
[]
["si =",{"$f":"F4/221.287","v":0.004519018288467013},null,null,"T",{"$f":"RAUFRIGO!G14","v":5}]
["ta =",{"$f":"(F3+273.15)/647.3","v":0.4297080179205932},null,null,"p",1]
["gu =",{"$f":"370000000-312219900*(B4^2)-199985*(B4^-6)","v":280583341.81253403}]
["gw =",{"$f":"B5+((1.72*(B5^2)+13629260000000000*(B3-1.500705*B4))^0.5)","v":636508922.0237849},null,null,"Dichte",{"$f":"1/B7","v":{"v":1000.0202112352772,"d":"1000.0 kg/m3"}}]
["kv =",{"$f":"0.417/(B6^(1/3.4))-0.0001139706+0.00009949927*B4+((0.6537154-B4)^2)*(0.00007241165+((0.6537154-B4)^8)*0.7676621)-0.00000000001052358*(62.5+13.10268*B3+(B3^2))/(0.000015108+(B4^11))","v":{"v":9.9997978917320857E-4,"d":"0.00099998"}}]
[]
[]
[]
[null,null,"lamb0","lamb1","lamb2","lamb3","lamb4","lamb5","lamb6","lamb7","lamb8","lamb9","lamb10","Fehler"]
["k=",{"v":0.007,"d":"0.007 "},{"v":0.1,"d":"0.1 "},{"$f":"(-2*LOG((($B$12/$B$13)/3.71)+(2.51/($B$14*(C12)^0.5))))^(-2)","v":{"v":0.015984669122503157,"d":"0.015985 "}},{"$f":"(-2*LOG((($B$12/$B$13)/3.71)+(2.51/($B$14*(D12)^0.5))))^(-2)","v":{"v":0.019236972538322655,"d":"0.019237 "}},{"v":0.0188488990590924,"d":"0.018849 "},{"v":0.01889088041230162,"d":"0.018891 "},{"v":0.018886288839776784,"d":"0.018886 "},{"v":0.018886790428167415,"d":"0.018887 "},{"v":0.018886735626948155,"d":"0.018887 "},{"v":0.018886741614189566,"d":"0.018887 "},{"v":0.018886740960059673,"d":"0.018887 "},{"v":0.01888674103152595,"d":"0.018887 "},{"$f":"(M12-L12)*100/M12","v":{"v":3.7839390724506752E-7,"d":"0.0000004 "}}]
["di=",{"$f":"RAUFRIGO!G10-(2*RAUFRIGO!G11)","v":96.8}]
["Re=",{"$f":"RAUFRIGO!M6","v":{"v":86754.51855486212,"d":"86755"}},"Fehler",{"$f":"N12","v":{"v":3.7839390724506752E-7,"d":"0.0000004 "}}]
[null,null,"l=",{"$f":"M12","v":{"v":0.01888674103152595,"d":"0.01889"}}]
[]
[]
[null,"SDR",11,"SDR",7.4,"Zähler"]
[{"$nulls":3},{"v":16,"d":"16.0"},2.2,{"v":1,"d":"1.0"}]
[null,{"v":20,"d":"20.0"},1.9,{"v":20,"d":"20.0"},2.8]
[null,{"v":25,"d":"25.0"},2.3,{"v":25,"d":"25.0"},3.5]
[null,{"v":32,"d":"32.0"},2.9,{"v":32,"d":"32.0"},4.4]
[null,{"v":40,"d":"40.0"},3.7,{"v":40,"d":"40.0"},5.5]
[null,{"v":50,"d":"50.0"},4.6,{"v":50,"d":"50.0"},6.9]
[null,{"v":63,"d":"63.0"},5.8,{"v":63,"d":"63.0"},8.7]
[null,{"v":75,"d":"75.0"},6.8]
[null,{"v":90,"d":"90.0"},8.2]
[null,{"v":110,"d":"110.0"},{"v":10,"d":"10.0"}]
[null,{"v":160,"d":"160.0"},14.6]